develooper Front page | perl.daily-build.reports | Postings from December 2019

Smoke [blead] v5.31.6-169-g4357af6ce6 PASS netbsd 7.2 (amd64/1 cpu)

From:
Carlos Guevara
Date:
December 20, 2019 05:32
Subject:
Smoke [blead] v5.31.6-169-g4357af6ce6 PASS netbsd 7.2 (amd64/1 cpu)
Message ID:
20191220053219.B92D516C1A1@cjg-netbsd7
Automated smoke report for branch blead 5.31.7 patch 4357af6ce6bbf62e83c554355bd8063b6fd0880a v5.31.6-169-g4357af6ce6
cjg-netbsd7: Intel 686-class (amd64/1 cpu)
    on        netbsd - 7.2
    using     gcc version 4.8.5
    smoketime 4 hours 39 minutes (average 34 minutes 55 seconds)

Summary: PASS

O = OK  F = Failure(s), extended report at the bottom
X = Failure(s) under TEST but not under harness
? = still running or test results not (yet) available
Build failures during:       - = unknown or N/A
c = Configure, m = make, M = make (after miniperl), t = make test-prep

v5.31.6-169-g4357af6ce6  Configuration (common) -Dcc=gcc
----------- ---------------------------------------------------------
O O         
O O         -Duse64bitall
O O         -Duseithreads
O O         -Duseithreads -Duse64bitall
| +--------- -DDEBUGGING
+----------- no debugging


Locally applied patches:
    SMOKE4357af6ce6bbf62e83c554355bd8063b6fd0880a

Testsuite was run only with 'harness'

Tests skipped on user request:
    # One test name on a line
Compiler messages(gcc):
op.c: In function 'Perl_pmruntime':
op.c:7277:15: warning: 't_cp' may be used uninitialized in this function [-Wmaybe-uninitialized]
op.c:6868:14: note: 't_cp' was declared here
op.c:7314:45: warning: 'r_cp' may be used uninitialized in this function [-Wmaybe-uninitialized]
op.c:6868:8: note: 'r_cp' was declared here
/usr/include/sys/cdefs_elf.h:67:20: error: missing binary operator before token "("
/usr/include/sys/cdefs_elf.h:73:20: error: missing binary operator before token "("
/usr/include/sys/cdefs_elf.h:79:20: error: missing binary operator before token "("
RealPPPort.c: In function 'XS_Devel__PPPort_isASCII_utf8_safe':
RealPPPort.c:4932:6: warning: unused variable 'offset' [-Wunused-variable]
RealPPPort.c: In function 'XS_Devel__PPPort_isASCII_LC_utf8_safe':
RealPPPort.c:5638:6: warning: unused variable 'offset' [-Wunused-variable]
Encode.c: In function 'XS_Encode_decode':
../../XSUB.h:185:20: warning: unused variable 'ix' [-Wunused-variable]
Encode.c:1356:5: note: in expansion of macro 'dXSI32'
Encode.c: In function 'XS_Encode_encode':
Encode.c:1398:5: note: in expansion of macro 'dXSI32'
Socket.c: In function 'XS_Socket_pack_ip_mreq_source':
Socket.c:1673:7: warning: variable 'interface' set but not used [-Wunused-but-set-variable]
Piece.xs: In function '_strptime':
Piece.xs:719:8: warning: 'len' may be used uninitialized in this function [-Wmaybe-uninitialized]
re_exec.c: In function 'S_regtry':
re_exec.c:6539:30: warning: 'fold_array' may be used uninitialized in this function [-Wmaybe-uninitialized]
re_exec.c:6443:17: note: 'fold_array' was declared here
re_exec.c:6545:28: warning: 'folder' may be used uninitialized in this function [-Wmaybe-uninitialized]
re_exec.c:6442:16: note: 'folder' was declared here
op.c: In function 'S_pmtrans':
op.c:7052:22: warning: 'r_map' may be used uninitialized in this function [-Wmaybe-uninitialized]
regexec.c: In function 'S_regtry':
regexec.c:6539:30: warning: 'fold_array' may be used uninitialized in this function [-Wmaybe-uninitialized]
regexec.c:6443:17: note: 'fold_array' was declared here
regexec.c:6545:28: warning: 'folder' may be used uninitialized in this function [-Wmaybe-uninitialized]
regexec.c:6442:16: note: 'folder' was declared here

Non-Fatal messages(gcc):



-- 
Report by Test::Smoke v1.71 running on perl 5.26.1
(Reporter v0.053 / Smoker v0.046)



nntp.perl.org: Perl Programming lists via nntp and http.
Comments to Ask Bjørn Hansen at ask@perl.org | Group listing | About