develooper Front page | perl.daily-build.reports | Postings from December 2019

Smoke [blead] v5.31.6-168-g84d8fb5866 FAIL(F) linux 4.19.0-6-amd64[Debian GNU/Linux 10.2 (x86_64/1 cpu)

From:
Carlos Guevara
Date:
December 20, 2019 05:22
Subject:
Smoke [blead] v5.31.6-168-g84d8fb5866 FAIL(F) linux 4.19.0-6-amd64[Debian GNU/Linux 10.2 (x86_64/1 cpu)
Message ID:
E1iiAjn-0001Qh-Bv@cjg-buster
Automated smoke report for branch blead 5.31.7 patch 84d8fb58665c60eb8e5f0b845466b898b8fa21f8 v5.31.6-168-g84d8fb5866
cjg-buster: Intel(R) Xeon(R) CPU E5-2620 v2 @ 2.10GHz (GenuineIntel 2060MHz) (x86_64/1 cpu)
    on        linux - 4.19.0-6-amd64 [Debian GNU/Linux 10.2 (buster)]
    using     gcc version 8.3.0
    smoketime 6 hours 38 minutes (average 33 minutes 10 seconds)

Summary: FAIL(F)

O = OK  F = Failure(s), extended report at the bottom
X = Failure(s) under TEST but not under harness
? = still running or test results not (yet) available
Build failures during:       - = unknown or N/A
c = Configure, m = make, M = make (after miniperl), t = make test-prep

v5.31.6-168-g84d8fb5866  Configuration (common) -Dcc=gcc
----------- ---------------------------------------------------------
F F         
F O         -Duse64bitall
F O         -Dusequadmath
O F         -Duseithreads
O F         -Duseithreads -Duse64bitall
O F         -Duseithreads -Dusequadmath
| +--------- -DDEBUGGING
+----------- no debugging


Locally applied patches:
    SMOKE84d8fb58665c60eb8e5f0b845466b898b8fa21f8

Testsuite was run only with 'harness'

Tests skipped on user request:
    # One test name on a line
Failures: (common-args) -Dcc=gcc
[default] 
[default] -DDEBUGGING -Duseithreads
../dist/Time-HiRes/t/usleep.t...............................FAILED
    6
    Non-zero exit status: 1

[default] -DDEBUGGING
../dist/Time-HiRes/t/usleep.t...............................FAILED
    3
    Non-zero exit status: 1

[default] -Duse64bitall
[default] -Dusequadmath
../dist/IO/t/io_poll.t......................................FAILED
    12

[default] -DDEBUGGING -Duseithreads -Duse64bitall
../dist/IO/t/io_poll.t......................................FAILED
    12
../dist/Time-HiRes/t/nanosleep.t............................FAILED
    3
    Non-zero exit status: 1

[default] -DDEBUGGING -Duseithreads -Dusequadmath
../cpan/ExtUtils-Constant/t/Constant.t......................FAILED
    63
    Bad plan.  You planned 302 tests but ran 63.

Compiler messages(gcc):
RealPPPort.c: In function 'XS_Devel__PPPort_isASCII_utf8_safe':
RealPPPort.c:4932:6: warning: unused variable 'offset' [-Wunused-variable]
RealPPPort.c: In function 'XS_Devel__PPPort_isASCII_LC_utf8_safe':
RealPPPort.c:5638:6: warning: unused variable 'offset' [-Wunused-variable]
Encode.c: In function 'XS_Encode_decode':
../../XSUB.h:185:20: warning: unused variable 'ix' [-Wunused-variable]
../../XSUB.h:185:20: note: in definition of macro 'dXSI32'
Encode.c: In function 'XS_Encode_encode':
./const-xs.inc: In function 'boot_Socket':
./const-xs.inc:131:13: warning: AI_IDN_ALLOW_UNASSIGNED is deprecated
./const-xs.inc:134:13: warning: AI_IDN_USE_STD3_ASCII_RULES is deprecated
./const-xs.inc:386:13: warning: NI_IDN_ALLOW_UNASSIGNED is deprecated
./const-xs.inc:389:13: warning: NI_IDN_USE_STD3_ASCII_RULES is deprecated
op.c: In function 'S_pmtrans':
op.c:7052:22: warning: 'r_map' may be used uninitialized in this function [-Wmaybe-uninitialized]

Non-Fatal messages(gcc):



-- 
Report by Test::Smoke v1.71 running on perl 5.26.1
(Reporter v0.053 / Smoker v0.046)



nntp.perl.org: Perl Programming lists via nntp and http.
Comments to Ask Bjørn Hansen at ask@perl.org | Group listing | About