develooper Front page | perl.daily-build.reports | Postings from December 2019

Smoke [smoke-me/khw-locale] v5.31.6-154-gd4fc9f4e14 FAIL(F) linux4.15.0-72-generic [Ubuntu 18.04.3 LTS (x86_64/1 cpu)

Thread Next
From:
Carlos Guevara
Date:
December 19, 2019 19:33
Subject:
Smoke [smoke-me/khw-locale] v5.31.6-154-gd4fc9f4e14 FAIL(F) linux4.15.0-72-generic [Ubuntu 18.04.3 LTS (x86_64/1 cpu)
Message ID:
20191219193323.8C58F143C58@cjg-bionic
Automated smoke report for branch smoke-me/khw-locale 5.31.7 patch d4fc9f4e148694fe9dd65597960c2e8e9e44a399 v5.31.6-154-gd4fc9f4e14
cjg-bionic: Intel(R) Xeon(R) CPU E5-2620 v2 @ 2.10GHz (GenuineIntel 2060MHz) (x86_64/1 cpu)
    on        linux - 4.15.0-72-generic [Ubuntu 18.04.3 LTS (bionic)]
    using     gcc version 7.4.0
    smoketime 6 hours 40 minutes (average 33 minutes 24 seconds)

Summary: FAIL(F)

O = OK  F = Failure(s), extended report at the bottom
X = Failure(s) under TEST but not under harness
? = still running or test results not (yet) available
Build failures during:       - = unknown or N/A
c = Configure, m = make, M = make (after miniperl), t = make test-prep

v5.31.6-154-gd4fc9f4e14  Configuration (common) -Dcc=gcc
----------- ---------------------------------------------------------
O O         
O O         -Duse64bitall
O O         -Dusequadmath
O O         -Duseithreads
O F         -Duseithreads -Duse64bitall
O F         -Duseithreads -Dusequadmath
| +--------- -DDEBUGGING
+----------- no debugging


Locally applied patches:
    SMOKEd4fc9f4e148694fe9dd65597960c2e8e9e44a399

Testsuite was run only with 'harness'

Tests skipped on user request:
    # One test name on a line
Failures: (common-args) -Dcc=gcc
[default] -DDEBUGGING -Duseithreads -Duse64bitall
../dist/Time-HiRes/t/usleep.t...............................FAILED
    6
    Non-zero exit status: 1

[default] -DDEBUGGING -Duseithreads -Dusequadmath
../cpan/ExtUtils-Constant/t/Constant.t......................FAILED
    133
    Bad plan.  You planned 302 tests but ran 133.
../dist/Time-HiRes/t/alarm.t................................FAILED
    2
    Non-zero exit status: 1

Compiler messages(gcc):
RealPPPort.c: In function 'XS_Devel__PPPort_isASCII_utf8_safe':
RealPPPort.c:4932:6: warning: unused variable 'offset' [-Wunused-variable]
RealPPPort.c: In function 'XS_Devel__PPPort_isASCII_LC_utf8_safe':
RealPPPort.c:5638:6: warning: unused variable 'offset' [-Wunused-variable]
Encode.c: In function 'XS_Encode_decode':
../../XSUB.h:185:20: warning: unused variable 'ix' [-Wunused-variable]
../../XSUB.h:185:20: note: in definition of macro 'dXSI32'
Encode.c: In function 'XS_Encode_encode':
POSIX.c: In function 'XS_POSIX_mbtowc':
POSIX.c:4577:9: warning: unused variable 's' [-Wunused-variable]
POSIX.c: In function 'XS_POSIX_wctomb':
POSIX.c:4648:9: warning: unused variable 's' [-Wunused-variable]
op.c: In function 'S_pmtrans':
op.c:7050:22: warning: 'r_map' may be used uninitialized in this function [-Wmaybe-uninitialized]

Non-Fatal messages(gcc):



-- 
Report by Test::Smoke v1.71 running on perl 5.26.1
(Reporter v0.053 / Smoker v0.046)

Thread Next


nntp.perl.org: Perl Programming lists via nntp and http.
Comments to Ask Bjørn Hansen at ask@perl.org | Group listing | About