develooper Front page | perl.daily-build.reports | Postings from December 2019

Smoke [blead] v5.31.6-100-g72b8e1a24a FAIL(F) linux 5.3.0-2-amd64[Debian GNU/Linux bullseye/sid] (x86_64/1 cpu)

From:
Carlos Guevara
Date:
December 8, 2019 07:27
Subject:
Smoke [blead] v5.31.6-100-g72b8e1a24a FAIL(F) linux 5.3.0-2-amd64[Debian GNU/Linux bullseye/sid] (x86_64/1 cpu)
Message ID:
E1idqy6-002CZQ-8O@cjg-bullseye
Automated smoke report for branch blead 5.31.7 patch 72b8e1a24ab8931021b00a2a11ef7f36afb88e38 v5.31.6-100-g72b8e1a24a
cjg-bullseye: Intel(R) Xeon(R) CPU E5-2620 v2 @ 2.10GHz (GenuineIntel 2072MHz) (x86_64/1 cpu)
    on        linux - 5.3.0-2-amd64 [Debian GNU/Linux bullseye/sid]
    using     g++ version 9.2.1 20191130
    smoketime 6 hours 44 minutes (average 33 minutes 40 seconds)

Summary: FAIL(F)

O = OK  F = Failure(s), extended report at the bottom
X = Failure(s) under TEST but not under harness
? = still running or test results not (yet) available
Build failures during:       - = unknown or N/A
c = Configure, m = make, M = make (after miniperl), t = make test-prep

v5.31.6-100-g72b8e1a24a  Configuration (common) -Dcc=g++
----------- ---------------------------------------------------------
F F         
F O         -Duse64bitall
O F         -Dusequadmath
O F         -Duseithreads
F O         -Duseithreads -Duse64bitall
F O         -Duseithreads -Dusequadmath
| +--------- -DDEBUGGING
+----------- no debugging


Locally applied patches:
    SMOKE72b8e1a24ab8931021b00a2a11ef7f36afb88e38

Testsuite was run only with 'harness'

Tests skipped on user request:
    # One test name on a line
Failures: (common-args) -Dcc=g++
[default] 
../dist/Time-HiRes/t/usleep.t...............................FAILED
    5
    Non-zero exit status: 1

[default] -DDEBUGGING
../cpan/ExtUtils-Constant/t/Constant.t......................FAILED
    259
    Bad plan.  You planned 302 tests but ran 259.

[default] -Duse64bitall
../cpan/ExtUtils-Constant/t/Constant.t......................FAILED
    63
    Bad plan.  You planned 302 tests but ran 63.

[default] -DDEBUGGING -Dusequadmath
../cpan/ExtUtils-Constant/t/Constant.t......................FAILED
    205
    Bad plan.  You planned 302 tests but ran 205.

[default] -DDEBUGGING -Duseithreads
../cpan/ExtUtils-MakeMaker/t/eu_command.t...................FAILED
    8
    Non-zero exit status: 1
../cpan/IO-Compress/t/004gziphdr.t..........................FAILED
    52
    Non-zero exit status: 1

[default] -Duseithreads -Duse64bitall
../dist/Time-HiRes/t/usleep.t...............................FAILED
    4
    Non-zero exit status: 1

[default] -Duseithreads -Dusequadmath
../dist/IO/t/io_poll.t......................................FAILED
    12

Compiler messages(gcc):
mg.c: In function 'int Perl_magic_set(SV*, MAGIC*)':
mg.c:2817:50: warning: type qualifiers ignored on cast result type [-Wignored-qualifiers]
regexp.h:530:43: note: in definition of macro 'RXp_ENGINE'
regexp.h:531:53: note: in expansion of macro 'ReANY'
perl.h:250:5: note: in expansion of macro 'RX_ENGINE'
mg.c:2817:13: note: in expansion of macro 'CALLREG_NUMBUF_STORE'
perl.h:250:47: note: in definition of macro 'CALLREG_NUMBUF_STORE'
inflate.c: In function 'int inflate(z_streamp, int)':
inflate.c:724:25: warning: this statement may fall through [-Wimplicit-fallthrough=]
inflate.c:725:9: note: here
inflate.c:732:25: warning: this statement may fall through [-Wimplicit-fallthrough=]
inflate.c:733:9: note: here
inflate.c:947:25: warning: this statement may fall through [-Wimplicit-fallthrough=]
inflate.c:948:9: note: here
inflate.c:968:25: warning: this statement may fall through [-Wimplicit-fallthrough=]
inflate.c:969:9: note: here
RealPPPort.c: In function 'void XS_Devel__PPPort_isASCII_utf8_safe(CV*)':
RealPPPort.c:4932:6: warning: unused variable 'offset' [-Wunused-variable]
RealPPPort.c: In function 'void XS_Devel__PPPort_isASCII_LC_utf8_safe(CV*)':
RealPPPort.c:5638:6: warning: unused variable 'offset' [-Wunused-variable]
MD5.xs: In function 'MD5_CTX* get_md5_ctx(SV*)':
MD5.xs:470:50: warning: type qualifiers ignored on cast result type [-Wignored-qualifiers]
MD5.xs: In function 'SV* new_md5_ctx(MD5_CTX*, const char*)':
MD5.xs:492:63: warning: type qualifiers ignored on cast result type [-Wignored-qualifiers]
../../embed.h:610:63: note: in definition of macro 'sv_magicext'
Encode.c: In function 'void XS_Encode_decode(CV*)':
../../XSUB.h:185:20: warning: unused variable 'ix' [-Wunused-variable]
../../XSUB.h:185:20: note: in definition of macro 'dXSI32'
Encode.c: In function 'void XS_Encode_encode(CV*)':
./const-xs.inc:131:13: warning: AI_IDN_ALLOW_UNASSIGNED is deprecated
./const-xs.inc:134:13: warning: AI_IDN_USE_STD3_ASCII_RULES is deprecated
./const-xs.inc:386:13: warning: NI_IDN_ALLOW_UNASSIGNED is deprecated
./const-xs.inc:389:13: warning: NI_IDN_USE_STD3_ASCII_RULES is deprecated
HiRes.xs: In function 'void XS_Time__HiRes_setitimer(CV*)':
../../perl.h:423:30: warning: option '-Wc++-compat' is valid for C/ObjC but not for C++ [-Wpragmas]
../../perl.h:426:30: note: in expansion of macro 'GCC_DIAG_PRAGMA'
../../perl.h:434:33: note: in expansion of macro 'GCC_DIAG_IGNORE'
HiRes.xs:1436:9: note: in expansion of macro 'GCC_DIAG_IGNORE_STMT'
HiRes.xs: In function 'void XS_Time__HiRes_getitimer(CV*)':
HiRes.xs:1456:9: note: in expansion of macro 'GCC_DIAG_IGNORE_STMT'
op.c: In function 'OP* S_pmtrans(OP*, OP*, OP*)':
op.c:7050:22: warning: 'r_map' may be used uninitialized in this function [-Wmaybe-uninitialized]
mg.c: In function 'int Perl_magic_set(PerlInterpreter*, SV*, MAGIC*)':
RealPPPort.c: In function 'void XS_Devel__PPPort_isASCII_utf8_safe(PerlInterpreter*, CV*)':
RealPPPort.c: In function 'void XS_Devel__PPPort_isASCII_LC_utf8_safe(PerlInterpreter*, CV*)':
MD5.xs: In function 'MD5_CTX* get_md5_ctx(PerlInterpreter*, SV*)':
MD5.xs: In function 'SV* new_md5_ctx(PerlInterpreter*, MD5_CTX*, const char*)':
Encode.c: In function 'void XS_Encode_decode(PerlInterpreter*, CV*)':
Encode.c: In function 'void XS_Encode_encode(PerlInterpreter*, CV*)':
Opcode.xs: In function 'void opmask_addlocal(PerlInterpreter*, SV*, char*)':
Opcode.xs:240:33: warning: cast between incompatible function types from 'void (*)(PerlInterpreter*, const char*, ...)' {aka 'void (*)(interpreter*, const char*, ...)'} to 'void (*)(void*)' [-Wcast-function-type]
../../embed.h:497:57: note: in definition of macro 'save_destructor'
Opcode.xs:240:2: note: in expansion of macro 'SAVEDESTRUCTOR'
HiRes.xs: In function 'void XS_Time__HiRes_setitimer(PerlInterpreter*, CV*)':
HiRes.xs: In function 'void XS_Time__HiRes_getitimer(PerlInterpreter*, CV*)':
op.c: In function 'OP* S_pmtrans(PerlInterpreter*, OP*, OP*, OP*)':

Non-Fatal messages(gcc):



-- 
Report by Test::Smoke v1.71 running on perl 5.26.1
(Reporter v0.053 / Smoker v0.046)



nntp.perl.org: Perl Programming lists via nntp and http.
Comments to Ask Bjørn Hansen at ask@perl.org | Group listing | About