develooper Front page | perl.daily-build.reports | Postings from December 2019

Smoke [smoke-me/khw-lexact] v5.31.6-47-g1bd949c3f0 FAIL(F) linux4.15.0-72-generic [Ubuntu 18.04.3 LTS (x86_64/1 cpu)

From:
Carlos Guevara
Date:
December 8, 2019 06:39
Subject:
Smoke [smoke-me/khw-lexact] v5.31.6-47-g1bd949c3f0 FAIL(F) linux4.15.0-72-generic [Ubuntu 18.04.3 LTS (x86_64/1 cpu)
Message ID:
20191208063900.8910E1462E4@cjg-bionic
Automated smoke report for branch smoke-me/khw-lexact 5.31.7 patch 1bd949c3f0919bb53f24b37c9e873b0662c4c052 v5.31.6-47-g1bd949c3f0
cjg-bionic: Intel(R) Xeon(R) CPU E5-2620 v2 @ 2.10GHz (GenuineIntel 2072MHz) (x86_64/1 cpu)
    on        linux - 4.15.0-72-generic [Ubuntu 18.04.3 LTS (bionic)]
    using     gcc version 7.4.0
    smoketime 6 hours 39 minutes (average 33 minutes 18 seconds)

Summary: FAIL(F)

O = OK  F = Failure(s), extended report at the bottom
X = Failure(s) under TEST but not under harness
? = still running or test results not (yet) available
Build failures during:       - = unknown or N/A
c = Configure, m = make, M = make (after miniperl), t = make test-prep

v5.31.6-47-g1bd949c3f0  Configuration (common) -Dcc=gcc
----------- ---------------------------------------------------------
O O         
O O         -Duse64bitall
F O         -Dusequadmath
O F         -Duseithreads
F F         -Duseithreads -Duse64bitall
O O         -Duseithreads -Dusequadmath
| +--------- -DDEBUGGING
+----------- no debugging


Locally applied patches:
    SMOKE1bd949c3f0919bb53f24b37c9e873b0662c4c052

Testsuite was run only with 'harness'

Tests skipped on user request:
    # One test name on a line
Failures: (common-args) -Dcc=gcc
[default] -Dusequadmath
[default] -DDEBUGGING -Duseithreads
../dist/Time-HiRes/t/ualarm.t...............................FAILED
    9-10
    Non-zero exit status: 2

[default] -Duseithreads -Duse64bitall
../dist/IO/t/io_poll.t......................................FAILED
    12

[default] -DDEBUGGING -Duseithreads -Duse64bitall
../dist/Time-HiRes/t/usleep.t...............................FAILED
    6
    Non-zero exit status: 1

Compiler messages(gcc):
regcomp.c: In function 'S_regatom':
regcomp.c:14883:30: warning: 'old_redo_e' may be used uninitialized in this function [-Wmaybe-uninitialized]
RealPPPort.c: In function 'XS_Devel__PPPort_isASCII_utf8_safe':
RealPPPort.c:4932:6: warning: unused variable 'offset' [-Wunused-variable]
RealPPPort.c: In function 'XS_Devel__PPPort_isASCII_LC_utf8_safe':
RealPPPort.c:5638:6: warning: unused variable 'offset' [-Wunused-variable]
Encode.c: In function 'XS_Encode_decode':
../../XSUB.h:185:20: warning: unused variable 'ix' [-Wunused-variable]
../../XSUB.h:185:20: note: in definition of macro 'dXSI32'
Encode.c: In function 'XS_Encode_encode':
re_comp.c: In function 'S_regatom':
re_comp.c:14883:30: warning: 'old_redo_e' may be used uninitialized in this function [-Wmaybe-uninitialized]
op.c: In function 'S_pmtrans':
op.c:7050:22: warning: 'r_map' may be used uninitialized in this function [-Wmaybe-uninitialized]

Non-Fatal messages(gcc):



-- 
Report by Test::Smoke v1.71 running on perl 5.26.1
(Reporter v0.053 / Smoker v0.046)



nntp.perl.org: Perl Programming lists via nntp and http.
Comments to Ask Bjørn Hansen at ask@perl.org | Group listing | About