develooper Front page | perl.daily-build.reports | Postings from December 2019

Smoke [smoke-me/khw-shay] v5.30.1-5-gffffbf0d2b FAIL(FM) linux4.19.0-6-amd64 [Debian GNU/Linux 10.2 (x86_64/1 cpu)

From:
Carlos Guevara
Date:
December 7, 2019 09:35
Subject:
Smoke [smoke-me/khw-shay] v5.30.1-5-gffffbf0d2b FAIL(FM) linux4.19.0-6-amd64 [Debian GNU/Linux 10.2 (x86_64/1 cpu)
Message ID:
E1idWUA-0008P1-Kr@cjg-buster
Automated smoke report for branch smoke-me/khw-shay 5.30.1 patch ffffbf0d2b8625c2025ce3a3c74e9013b939b97c v5.30.1-5-gffffbf0d2b
cjg-buster: Intel(R) Xeon(R) CPU E5-2620 v2 @ 2.10GHz (GenuineIntel 2072MHz) (x86_64/1 cpu)
    on        linux - 4.19.0-6-amd64 [Debian GNU/Linux 10.2 (buster)]
    using     gcc version 8.3.0
    smoketime 5 hours 59 minutes (average 29 minutes 58 seconds)

Summary: FAIL(FM)

O = OK  F = Failure(s), extended report at the bottom
X = Failure(s) under TEST but not under harness
? = still running or test results not (yet) available
Build failures during:       - = unknown or N/A
c = Configure, m = make, M = make (after miniperl), t = make test-prep

v5.30.1-5-gffffbf0d2b  Configuration (common) -Dcc=gcc
----------- ---------------------------------------------------------
O F         
F O         -Duse64bitall
F O         -Dusequadmath
O O         -Duseithreads
M O         -Duseithreads -Duse64bitall
O O         -Duseithreads -Dusequadmath
| +--------- -DDEBUGGING
+----------- no debugging


Locally applied patches:
    SMOKEffffbf0d2b8625c2025ce3a3c74e9013b939b97c

Testsuite was run only with 'harness'

Tests skipped on user request:
    # One test name on a line
Failures: (common-args) -Dcc=gcc
[default] -DDEBUGGING
../dist/Time-HiRes/t/usleep.t...............................FAILED
    5
    Non-zero exit status: 1

[default] -Duse64bitall
../dist/Time-HiRes/t/nanosleep.t............................FAILED
    3
    Non-zero exit status: 1

[default] -Dusequadmath
../dist/Time-HiRes/t/alarm.t................................FAILED
    2
    Non-zero exit status: 1

[minitest] -Duseithreads -Duse64bitall
    t/re/pat ....................... FAILED--no leader found
    t/re/regex_sets ................ FAILED--no leader found
    t/re/script_run ................ FAILED--no leader found
    t/op/chdir ..................... FAILED--no leader found
    t/op/do ........................ FAILED--no leader found
    t/op/magic ..................... FAILED--expected 195 tests, saw 60
    t/op/pack ...................... FAILED--no leader found
    t/op/require_errors ............ FAILED--no leader found
    t/op/smartmatch ................ FAILED at test 350
    t/op/split_unicode ............. FAILED--no leader found
    t/op/tr ........................ FAILED--no leader found

Compiler messages(gcc):
perl.c: In function 'Perl_sys_init':
perl.h:2688:51: warning: cast between incompatible function types from '__sighandler_t' {aka 'void (*)(int)'} to 'void (*)(int,  siginfo_t *, void *)' {aka 'void (*)(int,  struct <anonymous> *, void *)'} [-Wcast-function-type]
unixish.h:150:29: note: in expansion of macro 'PERL_FPU_INIT'
perl.c:125:5: note: in expansion of macro 'PERL_SYS_INIT_BODY'
perl.c: In function 'Perl_sys_init3':
perl.h:2738:49: note: in expansion of macro 'PERL_SYS_INIT_BODY'
perl.c:138:5: note: in expansion of macro 'PERL_SYS_INIT3_BODY'
perl.c: In function 'S_parse_body':
perl.c:2470:22: warning: cast between incompatible function types from 'void (*)(int)' to 'void (*)(int,  siginfo_t *, void *)' {aka 'void (*)(int,  struct <anonymous> *, void *)'} [-Wcast-function-type]
perl.c:2473:26: warning: cast between incompatible function types from 'void (*)(int)' to 'void (*)(int,  siginfo_t *, void *)' {aka 'void (*)(int,  struct <anonymous> *, void *)'} [-Wcast-function-type]
embed.h:643:44: note: in definition of macro 'rsignal'
util.c: In function 'Perl_rsignal':
util.c:2698:22: warning: cast between incompatible function types from 'Sighandler_t' {aka 'void (*)(int,  struct <anonymous> *, void *)'} to 'void (*)(int)' [-Wcast-function-type]
util.c:2706:40: warning: cast between incompatible function types from 'void (*)(int)' to 'void (*)(int,  siginfo_t *, void *)' {aka 'void (*)(int,  struct <anonymous> *, void *)'} [-Wcast-function-type]
util.c:2710:13: warning: cast between incompatible function types from 'void (*)(int)' to 'void (*)(int,  siginfo_t *, void *)' {aka 'void (*)(int,  struct <anonymous> *, void *)'} [-Wcast-function-type]
util.c:2712:13: warning: cast between incompatible function types from '__sighandler_t' {aka 'void (*)(int)'} to 'void (*)(int,  siginfo_t *, void *)' {aka 'void (*)(int,  struct <anonymous> *, void *)'} [-Wcast-function-type]
util.c: In function 'Perl_rsignal_state':
util.c:2722:9: warning: cast between incompatible function types from 'void (*)(int)' to 'void (*)(int,  siginfo_t *, void *)' {aka 'void (*)(int,  struct <anonymous> *, void *)'} [-Wcast-function-type]
util.c:2724:9: warning: cast between incompatible function types from '__sighandler_t' {aka 'void (*)(int)'} to 'void (*)(int,  siginfo_t *, void *)' {aka 'void (*)(int,  struct <anonymous> *, void *)'} [-Wcast-function-type]
util.c: In function 'Perl_rsignal_save':
util.c:2743:22: warning: cast between incompatible function types from 'Sighandler_t' {aka 'void (*)(int,  struct <anonymous> *, void *)'} to 'void (*)(int)' [-Wcast-function-type]
util.c:2751:40: warning: cast between incompatible function types from 'void (*)(int)' to 'void (*)(int,  siginfo_t *, void *)' {aka 'void (*)(int,  struct <anonymous> *, void *)'} [-Wcast-function-type]
mg.c: In function 'Perl_magic_getsig':
mg.c:1465:25: warning: cast between incompatible function types from 'void (*)(int)' to 'void (*)(int,  siginfo_t *, void *)' {aka 'void (*)(int,  struct <anonymous> *, void *)'} [-Wcast-function-type]
mg.c: In function 'Perl_magic_setsig':
mg.c:1742:20: warning: cast between incompatible function types from 'void (*)(int)' to 'void (*)(int,  siginfo_t *, void *)' {aka 'void (*)(int,  struct <anonymous> *, void *)'} [-Wcast-function-type]
mg.c:1752:20: warning: cast between incompatible function types from 'void (*)(int)' to 'void (*)(int,  siginfo_t *, void *)' {aka 'void (*)(int,  struct <anonymous> *, void *)'} [-Wcast-function-type]
pp_sys.c: In function 'Perl_pp_system':
pp_sys.c:4421:28: warning: cast between incompatible function types from 'void (*)(int)' to 'void (*)(int,  siginfo_t *, void *)' {aka 'void (*)(int,  struct <anonymous> *, void *)'} [-Wcast-function-type]
embed.h:1560:55: note: in definition of macro 'rsignal_save'
pp_sys.c:4422:28: warning: cast between incompatible function types from 'void (*)(int)' to 'void (*)(int,  siginfo_t *, void *)' {aka 'void (*)(int,  struct <anonymous> *, void *)'} [-Wcast-function-type]
miniperlmain.c: In function 'main':
miniperlmain.c:139:29: warning: cast between incompatible function types from 'void (*)(int)' to 'void (*)(int,  siginfo_t *, void *)' {aka 'void (*)(int,  struct <anonymous> *, void *)'} [-Wcast-function-type]
perlmain.c: In function 'main':
perlmain.c:133:29: warning: cast between incompatible function types from 'void (*)(int)' to 'void (*)(int,  siginfo_t *, void *)' {aka 'void (*)(int,  struct <anonymous> *, void *)'} [-Wcast-function-type]
decompress.c: In function 'BZ2_decompress':
decompress.c:198:10: warning: this statement may fall through [-Wimplicit-fallthrough=]
decompress.c:44:4: note: here
decompress.c:68:4: note: in expansion of macro 'GET_BITS'
decompress.c:200:7: note: in expansion of macro 'GET_UCHAR'
decompress.c:201:10: warning: this statement may fall through [-Wimplicit-fallthrough=]
decompress.c:203:7: note: in expansion of macro 'GET_UCHAR'
decompress.c:204:10: warning: this statement may fall through [-Wimplicit-fallthrough=]
decompress.c:206:7: note: in expansion of macro 'GET_BITS'
decompress.c:211:10: warning: this statement may fall through [-Wimplicit-fallthrough=]
decompress.c:222:7: note: in expansion of macro 'GET_UCHAR'
decompress.c:225:10: warning: this statement may fall through [-Wimplicit-fallthrough=]
decompress.c:226:7: note: in expansion of macro 'GET_UCHAR'
decompress.c:227:10: warning: this statement may fall through [-Wimplicit-fallthrough=]
decompress.c:228:7: note: in expansion of macro 'GET_UCHAR'
decompress.c:229:10: warning: this statement may fall through [-Wimplicit-fallthrough=]
decompress.c:230:7: note: in expansion of macro 'GET_UCHAR'
decompress.c:231:10: warning: this statement may fall through [-Wimplicit-fallthrough=]
decompress.c:232:7: note: in expansion of macro 'GET_UCHAR'
decompress.c:233:10: warning: this statement may fall through [-Wimplicit-fallthrough=]
decompress.c:234:7: note: in expansion of macro 'GET_UCHAR'
decompress.c:241:25: warning: this statement may fall through [-Wimplicit-fallthrough=]
decompress.c:242:7: note: in expansion of macro 'GET_UCHAR'
decompress.c:243:25: warning: this statement may fall through [-Wimplicit-fallthrough=]
decompress.c:244:7: note: in expansion of macro 'GET_UCHAR'
decompress.c:245:25: warning: this statement may fall through [-Wimplicit-fallthrough=]
decompress.c:246:7: note: in expansion of macro 'GET_UCHAR'
decompress.c:247:25: warning: this statement may fall through [-Wimplicit-fallthrough=]
decompress.c:248:7: note: in expansion of macro 'GET_UCHAR'
decompress.c:249:25: warning: this statement may fall through [-Wimplicit-fallthrough=]
decompress.c:251:7: note: in expansion of macro 'GET_BITS'
decompress.c:253:18: warning: this statement may fall through [-Wimplicit-fallthrough=]
decompress.c:254:7: note: in expansion of macro 'GET_UCHAR'
decompress.c:255:18: warning: this statement may fall through [-Wimplicit-fallthrough=]
decompress.c:256:7: note: in expansion of macro 'GET_UCHAR'
decompress.c:257:18: warning: this statement may fall through [-Wimplicit-fallthrough=]
decompress.c:258:7: note: in expansion of macro 'GET_UCHAR'
decompress.c:284:17: warning: this statement may fall through [-Wimplicit-fallthrough=]
decompress.c:287:7: note: in expansion of macro 'GET_BITS'
decompress.c:288:10: warning: this statement may fall through [-Wimplicit-fallthrough=]
decompress.c:289:7: note: in expansion of macro 'GET_BITS'
decompress.c:292:12: warning: this statement may fall through [-Wimplicit-fallthrough=]
decompress.c:71:4: note: in expansion of macro 'GET_BITS'
decompress.c:294:13: note: in expansion of macro 'GET_BIT'
decompress.c:321:19: warning: this statement may fall through [-Wimplicit-fallthrough=]
decompress.c:322:16: note: in expansion of macro 'GET_BIT'
decompress.c:323:19: warning: this statement may fall through [-Wimplicit-fallthrough=]
decompress.c:324:16: note: in expansion of macro 'GET_BIT'
decompress.c:88:7: warning: this statement may fall through [-Wimplicit-fallthrough=]
decompress.c:373:7: note: in expansion of macro 'GET_MTF_VAL'
decompress.c:89:4: note: in expansion of macro 'GET_BITS'
decompress.c:94:9: warning: this statement may fall through [-Wimplicit-fallthrough=]
decompress.c:95:7: note: in expansion of macro 'GET_BIT'
decompress.c:483:13: note: in expansion of macro 'GET_MTF_VAL'
decompress.c:585:10: warning: this statement may fall through [-Wimplicit-fallthrough=]
decompress.c:586:7: note: in expansion of macro 'GET_UCHAR'
decompress.c:587:10: warning: this statement may fall through [-Wimplicit-fallthrough=]
decompress.c:588:7: note: in expansion of macro 'GET_UCHAR'
decompress.c:589:10: warning: this statement may fall through [-Wimplicit-fallthrough=]
decompress.c:590:7: note: in expansion of macro 'GET_UCHAR'
decompress.c:591:10: warning: this statement may fall through [-Wimplicit-fallthrough=]
decompress.c:592:7: note: in expansion of macro 'GET_UCHAR'
decompress.c:595:28: warning: this statement may fall through [-Wimplicit-fallthrough=]
decompress.c:596:7: note: in expansion of macro 'GET_UCHAR'
decompress.c:597:28: warning: this statement may fall through [-Wimplicit-fallthrough=]
decompress.c:598:7: note: in expansion of macro 'GET_UCHAR'
decompress.c:599:28: warning: this statement may fall through [-Wimplicit-fallthrough=]
decompress.c:600:7: note: in expansion of macro 'GET_UCHAR'
decompress.c:601:28: warning: this statement may fall through [-Wimplicit-fallthrough=]
decompress.c:602:7: note: in expansion of macro 'GET_UCHAR'
deflate.c: In function 'deflateParams':
deflate.c:602:28: warning: macro expands to multiple statements [-Wmultistatement-macros]
deflate.c:193:5: note: in definition of macro 'CLEAR_HASH'
deflate.c:601:13: note: some parts of macro expansion are not guarded by this 'else' clause
Encode.c: In function 'XS_Encode_decode':
../../XSUB.h:185:20: warning: unused variable 'ix' [-Wunused-variable]
../../XSUB.h:185:20: note: in definition of macro 'dXSI32'
Encode.c: In function 'XS_Encode_encode':
ListUtil.xs: In function 'XS_List__Util_sum':
ListUtil.xs:349:19: warning: this statement may fall through [-Wimplicit-fallthrough=]
ListUtil.xs:350:9: note: here
./const-xs.inc: In function 'boot_Socket':
./const-xs.inc:128:13: warning: AI_IDN_ALLOW_UNASSIGNED is deprecated
./const-xs.inc:131:13: warning: AI_IDN_USE_STD3_ASCII_RULES is deprecated
./const-xs.inc:383:13: warning: NI_IDN_ALLOW_UNASSIGNED is deprecated
./const-xs.inc:386:13: warning: NI_IDN_USE_STD3_ASCII_RULES is deprecated
util.c:2695:9: warning: cast between incompatible function types from 'void (*)(int)' to 'void (*)(int,  siginfo_t *, void *)' {aka 'void (*)(int,  struct <anonymous> *, void *)'} [-Wcast-function-type]
Opcode.xs: In function 'opmask_addlocal':
Opcode.xs:240:17: warning: cast between incompatible function types from 'void (*)(PerlInterpreter *, const char *, ...)' {aka 'void (*)(struct interpreter *, const char *, ...)'} to 'void (*)(void *)' [-Wcast-function-type]
../../embed.h:663:57: note: in definition of macro 'save_destructor'
Opcode.xs:240:2: note: in expansion of macro 'SAVEDESTRUCTOR'

Non-Fatal messages(gcc):



-- 
Report by Test::Smoke v1.71 running on perl 5.26.1
(Reporter v0.053 / Smoker v0.046)



nntp.perl.org: Perl Programming lists via nntp and http.
Comments to Ask Bjørn Hansen at ask@perl.org | Group listing | About