develooper Front page | perl.daily-build.reports | Postings from December 2019

Smoke [smoke-me/test_hv_macro] v5.31.5-301-gafe35d848d PASS netbsd8.1 (amd64/1 cpu)

Thread Previous
From:
Carlos Guevara
Date:
December 5, 2019 18:27
Subject:
Smoke [smoke-me/test_hv_macro] v5.31.5-301-gafe35d848d PASS netbsd8.1 (amd64/1 cpu)
Message ID:
20191205182624.332FF71D68@cjg-netbsd8
Automated smoke report for branch smoke-me/test_hv_macro 5.31.6 patch afe35d848d8d82e0df5f3bb47dc3c70d1598ec31 v5.31.5-301-gafe35d848d
cjg-netbsd8: Intel 686-class (amd64/1 cpu)
    on        netbsd - 8.1
    using     gcc version 5.5.0
    smoketime 5 hours 16 minutes (average 39 minutes 36 seconds)

Summary: PASS

O = OK  F = Failure(s), extended report at the bottom
X = Failure(s) under TEST but not under harness
? = still running or test results not (yet) available
Build failures during:       - = unknown or N/A
c = Configure, m = make, M = make (after miniperl), t = make test-prep

v5.31.5-301-gafe35d848d  Configuration (common) -Dcc=gcc
----------- ---------------------------------------------------------
O O         
O O         -Duse64bitall
O O         -Duseithreads
O O         -Duseithreads -Duse64bitall
| +--------- -DDEBUGGING
+----------- no debugging


Locally applied patches:
    SMOKEafe35d848d8d82e0df5f3bb47dc3c70d1598ec31

Testsuite was run only with 'harness'

Tests skipped on user request:
    # One test name on a line
Compiler messages(gcc):
regcomp.c: In function 'S_regatom':
regcomp.c:14596:43: warning: comparison is always false due to limited range of data type [-Wtype-limits]
perl.h:3573:62: note: in definition of macro 'EXPECT'
perl.h:3594:52: note: in expansion of macro 'cBOOL'
regcomp.c:14596:29: note: in expansion of macro 'UNLIKELY'
/usr/include/sys/cdefs_elf.h:67:20: error: missing binary operator before token "("
/usr/include/sys/cdefs_elf.h:73:20: error: missing binary operator before token "("
/usr/include/sys/cdefs_elf.h:79:20: error: missing binary operator before token "("
bzlib.c: In function 'default_bzalloc':
bzlib.c:102:31: warning: unused parameter 'opaque' [-Wunused-parameter]
bzlib.c: In function 'default_bzfree':
bzlib.c:109:29: warning: unused parameter 'opaque' [-Wunused-parameter]
compress.c: In function 'sendMTFValues':
compress.c:243:19: warning: variable 'nBytes' set but not used [-Wunused-but-set-variable]
RealPPPort.c: In function 'XS_Devel__PPPort_isASCII_utf8_safe':
RealPPPort.c:4932:6: warning: unused variable 'offset' [-Wunused-variable]
RealPPPort.c: In function 'XS_Devel__PPPort_isASCII_LC_utf8_safe':
RealPPPort.c:5638:6: warning: unused variable 'offset' [-Wunused-variable]
Encode.c: In function 'XS_Encode_decode':
../../XSUB.h:185:20: warning: unused variable 'ix' [-Wunused-variable]
Encode.c:1356:5: note: in expansion of macro 'dXSI32'
Encode.c: In function 'XS_Encode_encode':
Encode.c:1398:5: note: in expansion of macro 'dXSI32'
Socket.c: In function 'XS_Socket_pack_ip_mreq_source':
Socket.c:1673:7: warning: variable 'interface' set but not used [-Wunused-but-set-variable]
const-c.inc: In function 'constant_19':
const-c.inc:351:42: warning: unused parameter 'iv_return' [-Wunused-parameter]
APItest.c: In function 'XS_XS__APItest__HvMacro_u8_to_u16_le':
../../pp.h:419:25: warning: 'RETVAL' may be used uninitialized in this function [-Wmaybe-uninitialized]
APItest.c:13151:5: note: 'RETVAL' was declared here
re_exec.c: In function 'S_regtry':
re_exec.c:6497:30: warning: 'fold_array' may be used uninitialized in this function [-Wmaybe-uninitialized]
re_exec.c:6401:17: note: 'fold_array' was declared here
re_exec.c:6503:22: warning: 'folder' may be used uninitialized in this function [-Wmaybe-uninitialized]
re_exec.c:6400:16: note: 'folder' was declared here
re_comp.c: In function 'S_regatom':
re_comp.c:14596:43: warning: comparison is always false due to limited range of data type [-Wtype-limits]
../../perl.h:3573:62: note: in definition of macro 'EXPECT'
../../perl.h:3594:52: note: in expansion of macro 'cBOOL'
re_comp.c:14596:29: note: in expansion of macro 'UNLIKELY'
op.c: In function 'S_pmtrans':
op.c:7047:22: warning: 'r_map' may be used uninitialized in this function [-Wmaybe-uninitialized]
regexec.c: In function 'S_regtry':
regexec.c:6497:30: warning: 'fold_array' may be used uninitialized in this function [-Wmaybe-uninitialized]
regexec.c:6401:17: note: 'fold_array' was declared here
regexec.c:6503:22: warning: 'folder' may be used uninitialized in this function [-Wmaybe-uninitialized]
regexec.c:6400:16: note: 'folder' was declared here
../../embed.h:677:26: warning: 'RETVAL' may be used uninitialized in this function [-Wmaybe-uninitialized]

Non-Fatal messages(gcc):



-- 
Report by Test::Smoke v1.71 running on perl 5.26.1
(Reporter v0.053 / Smoker v0.046)

Thread Previous


nntp.perl.org: Perl Programming lists via nntp and http.
Comments to Ask Bjørn Hansen at ask@perl.org | Group listing | About