develooper Front page | perl.daily-build.reports | Postings from December 2019

Smoke [smoke-me/jkeenan/lgtm-regcomp-c] v5.31.6-77-gb1a5c515afFAIL(FM) linux 4.15.0-72-generic [Ubuntu 18.04.3 LTS (x86_64/1 cpu)

From:
Carlos Guevara
Date:
December 5, 2019 06:56
Subject:
Smoke [smoke-me/jkeenan/lgtm-regcomp-c] v5.31.6-77-gb1a5c515afFAIL(FM) linux 4.15.0-72-generic [Ubuntu 18.04.3 LTS (x86_64/1 cpu)
Message ID:
20191205064725.673CB1415E4@cjg-bionic
Automated smoke report for branch smoke-me/jkeenan/lgtm-regcomp-c 5.31.7 patch b1a5c515af7b2037fb2071908b9b5bd0c861ca39 v5.31.6-77-gb1a5c515af
cjg-bionic: Intel(R) Xeon(R) CPU E5-2620 v2 @ 2.10GHz (GenuineIntel 2072MHz) (x86_64/1 cpu)
    on        linux - 4.15.0-72-generic [Ubuntu 18.04.3 LTS (bionic)]
    using     gcc version 7.4.0
    smoketime 6 hours 2 minutes (average 30 minutes 14 seconds)

Summary: FAIL(FM)

O = OK  F = Failure(s), extended report at the bottom
X = Failure(s) under TEST but not under harness
? = still running or test results not (yet) available
Build failures during:       - = unknown or N/A
c = Configure, m = make, M = make (after miniperl), t = make test-prep

v5.31.6-77-gb1a5c515af  Configuration (common) -Dcc=gcc
----------- ---------------------------------------------------------
O O         
O O         -Duse64bitall
O F         -Dusequadmath
F F         -Duseithreads
O M         -Duseithreads -Duse64bitall
O O         -Duseithreads -Dusequadmath
| +--------- -DDEBUGGING
+----------- no debugging


Locally applied patches:
    SMOKEb1a5c515af7b2037fb2071908b9b5bd0c861ca39

Testsuite was run only with 'harness'

Tests skipped on user request:
    # One test name on a line
Failures: (common-args) -Dcc=gcc
[default] -DDEBUGGING -Dusequadmath
../dist/Time-HiRes/t/usleep.t...............................FAILED
    5
    Non-zero exit status: 1

[default] -Duseithreads
../dist/Time-HiRes/t/nanosleep.t............................FAILED
    3
    Non-zero exit status: 1

[default] -DDEBUGGING -Duseithreads
../dist/IO/t/io_poll.t......................................FAILED
    12

[minitest] -DDEBUGGING -Duseithreads -Duse64bitall
    t/re/pat ....................... FAILED--no leader found
    t/re/regex_sets ................ FAILED--no leader found
    t/re/script_run ................ FAILED--no leader found
    t/op/chdir ..................... FAILED--no leader found
    t/op/do ........................ FAILED--no leader found
    t/op/magic ..................... FAILED--expected 195 tests, saw 60
    t/op/pack ...................... FAILED--no leader found
    t/op/require_errors ............ FAILED--no leader found
    t/op/smartmatch ................ FAILED at test 350
    t/op/split_unicode ............. FAILED--no leader found
    t/op/taint ..................... FAILED--no leader found
    t/op/tr ........................ FAILED--no leader found

Compiler messages(gcc):
RealPPPort.c: In function 'XS_Devel__PPPort_isASCII_utf8_safe':
RealPPPort.c:4932:6: warning: unused variable 'offset' [-Wunused-variable]
RealPPPort.c: In function 'XS_Devel__PPPort_isASCII_LC_utf8_safe':
RealPPPort.c:5638:6: warning: unused variable 'offset' [-Wunused-variable]
Encode.c: In function 'XS_Encode_decode':
../../XSUB.h:185:20: warning: unused variable 'ix' [-Wunused-variable]
../../XSUB.h:185:20: note: in definition of macro 'dXSI32'
Encode.c: In function 'XS_Encode_encode':
op.c: In function 'S_pmtrans':
op.c:7050:22: warning: 'r_map' may be used uninitialized in this function [-Wmaybe-uninitialized]

Non-Fatal messages(gcc):



-- 
Report by Test::Smoke v1.71 running on perl 5.26.1
(Reporter v0.053 / Smoker v0.046)



nntp.perl.org: Perl Programming lists via nntp and http.
Comments to Ask Bjørn Hansen at ask@perl.org | Group listing | About