develooper Front page | perl.daily-build.reports | Postings from December 2019

Smoke [blead] v5.31.6-87-g5e91ca38ca FAIL(F) MSWin32 Win10 Business(Intel64/8 cpu) {mswin32-win10-blead}

From:
George Greer
Date:
December 5, 2019 00:38
Subject:
Smoke [blead] v5.31.6-87-g5e91ca38ca FAIL(F) MSWin32 Win10 Business(Intel64/8 cpu) {mswin32-win10-blead}
Message ID:
201912050038.xB50cURv027354@vier.local
[smoke setup in testing; ignore for now] Smoke logs available at http://m-lorg/~perl/smoke/perl/mswin32-x64-multi-thread-win10/mswin32-win10-blead/log5e91ca38cafa2b006f7671e941287e05d31c2d97.log.gz

Automated smoke report for branch blead 5.31.7 patch 5e91ca38cafa2b006f7671e941287e05d31c2d97 v5.31.6-87-g5e91ca38ca
Dell-Latitude-E6530: Intel(R) Core(TM) i7-3740QM CPU @ 2.70GHz(~2691 MHz) (Intel64/8 cpu)
    on        MSWin32 - Win10 Business
    using     cl version 19.23.28106.4
    smoketime 5 hours 3 minutes (average 37 minutes 58 seconds)

Summary: FAIL(F)

O = OK  F = Failure(s), extended report at the bottom
X = Failure(s) under TEST but not under harness
? = still running or test results not (yet) available
Build failures during:       - = unknown or N/A
c = Configure, m = make, M = make (after miniperl), t = make test-prep

v5.31.6-87-g5e91ca38ca  Configuration (common) none
----------- ---------------------------------------------------------
F F         
F F         -Duselargefiles
F F         -Duseithreads
F F         -Duseithreads -Duselargefiles
| +--------- -DDEBUGGING
+----------- no debugging


Locally applied patches:
    SMOKE5e91ca38cafa2b006f7671e941287e05d31c2d97

Failures: (common-args) none
[default] 
[default] -Duselargefiles
[default] -DDEBUGGING -Duselargefiles
../t/porting/customized.t...................................FAILED
    1-31
../t/porting/pod_rules.t....................................FAILED
    2-6
    Bad plan.  You planned 8 tests but ran 6.
../t/porting/regen.t........................................FAILED
    12
    Non-zero exit status: 255
    Bad plan.  You planned 45 tests but ran 12.
../cpan/CPAN-Meta-YAML/t/30_yaml_spec_tml.t.................FAILED
    Non-zero exit status: 2
    No plan found in TAP output
../cpan/CPAN-Meta-YAML/t/31_local_tml.t.....................FAILED
    Non-zero exit status: 2
    No plan found in TAP output
../cpan/CPAN-Meta-YAML/t/32_world_tml.t.....................FAILED
    Non-zero exit status: 2
    No plan found in TAP output
../cpan/ExtUtils-MakeMaker/t/02-xsdynamic.t.................FAILED
    17, 22, 35, 40
    Non-zero exit status: 4
../cpan/IO-Compress/t/105oneshot-zip-only.t.................FAILED
    227
    Non-zero exit status: 1
../cpan/Pod-Simple/t/JustPod_corpus.t.......................FAILED
    3-7, 10-19
    Non-zero exit status: 15
../cpan/podlators/t/text/encoding.t.........................FAILED
    Non-zero exit status: 255
    Bad plan.  You planned 7 tests but ran 1.
../dist/Net-Ping/t/450_service.t............................FAILED
    9
    Non-zero exit status: 1

[default] -DDEBUGGING
../t/porting/customized.t...................................FAILED
    1-31
../t/porting/pod_rules.t....................................FAILED
    2-6
    Bad plan.  You planned 8 tests but ran 6.
../t/porting/regen.t........................................FAILED
    12
    Non-zero exit status: 255
    Bad plan.  You planned 45 tests but ran 12.
../cpan/CPAN-Meta-YAML/t/30_yaml_spec_tml.t.................FAILED
    Non-zero exit status: 2
    No plan found in TAP output
../cpan/CPAN-Meta-YAML/t/31_local_tml.t.....................FAILED
    Non-zero exit status: 2
    No plan found in TAP output
../cpan/CPAN-Meta-YAML/t/32_world_tml.t.....................FAILED
    Non-zero exit status: 2
    No plan found in TAP output
../cpan/ExtUtils-MakeMaker/t/02-xsdynamic.t.................FAILED
    17, 22, 35, 40
    Non-zero exit status: 4
../cpan/IO-Compress/t/105oneshot-zip-only.t.................FAILED
    227
    Non-zero exit status: 1
../cpan/Pod-Simple/t/JustPod_corpus.t.......................FAILED
    3-7, 10-19
    Non-zero exit status: 15
../cpan/podlators/t/text/encoding.t.........................FAILED
    Non-zero exit status: 255
    Bad plan.  You planned 7 tests but ran 1.

[default] -Duseithreads
[default] -DDEBUGGING -Duseithreads
../t/porting/customized.t...................................FAILED
    1-31
../t/porting/pod_rules.t....................................FAILED
    2-6
    Bad plan.  You planned 8 tests but ran 6.
../t/porting/regen.t........................................FAILED
    12
    Non-zero exit status: 255
    Bad plan.  You planned 45 tests but ran 12.
../cpan/CPAN-Meta-YAML/t/30_yaml_spec_tml.t.................FAILED
    Non-zero exit status: 2
    No plan found in TAP output
../cpan/CPAN-Meta-YAML/t/31_local_tml.t.....................FAILED
    Non-zero exit status: 2
    No plan found in TAP output
../cpan/CPAN-Meta-YAML/t/32_world_tml.t.....................FAILED
    Non-zero exit status: 2
    No plan found in TAP output
../cpan/IO-Compress/t/105oneshot-zip-only.t.................FAILED
    227
    Non-zero exit status: 1
../cpan/Pod-Simple/t/JustPod_corpus.t.......................FAILED
    3-7, 10-19
    Non-zero exit status: 15
../cpan/podlators/t/text/encoding.t.........................FAILED
    Non-zero exit status: 255
    Bad plan.  You planned 7 tests but ran 1.
../dist/IO/t/cachepropagate-tcp.t...........................FAILED
    Non-zero exit status: 9
    Bad plan.  You planned 8 tests but ran 5.
../dist/Net-Ping/t/450_service.t............................FAILED
    9
    Non-zero exit status: 1

[default] -Duseithreads -Duselargefiles
[default] -DDEBUGGING -Duseithreads -Duselargefiles
../t/porting/customized.t...................................FAILED
    1-31
../t/porting/pod_rules.t....................................FAILED
    2-6
    Bad plan.  You planned 8 tests but ran 6.
../t/porting/regen.t........................................FAILED
    12
    Non-zero exit status: 255
    Bad plan.  You planned 45 tests but ran 12.
../cpan/CPAN-Meta-YAML/t/30_yaml_spec_tml.t.................FAILED
    Non-zero exit status: 2
    No plan found in TAP output
../cpan/CPAN-Meta-YAML/t/31_local_tml.t.....................FAILED
    Non-zero exit status: 2
    No plan found in TAP output
../cpan/CPAN-Meta-YAML/t/32_world_tml.t.....................FAILED
    Non-zero exit status: 2
    No plan found in TAP output
../cpan/IO-Compress/t/105oneshot-zip-only.t.................FAILED
    227
    Non-zero exit status: 1
../cpan/Pod-Simple/t/JustPod_corpus.t.......................FAILED
    3-7, 10-19
    Non-zero exit status: 15
../cpan/podlators/t/text/encoding.t.........................FAILED
    Non-zero exit status: 255
    Bad plan.  You planned 7 tests but ran 1.
../dist/Net-Ping/t/450_service.t............................FAILED
    9
    Non-zero exit status: 1

Passed Todo tests: (common-args) none
[default] 
[default] -DDEBUGGING
[default] -Duselargefiles
[default] -DDEBUGGING -Duselargefiles
[default] -Duseithreads
[default] -DDEBUGGING -Duseithreads
[default] -Duseithreads -Duselargefiles
[default] -DDEBUGGING -Duseithreads -Duselargefiles
../ext/IPC-Open3/t/IPC-Open3.t..............................PASSED
    25

Compiler messages(MSWin32):
[2019-12-04 19:37:09Z] perlio.obj : warning LNK4197: export 'PerlIO_pending' specified multiple times; using first specification
[2019-12-04 19:37:09Z] perlio.obj : warning LNK4197: export 'PerlIO_perlio' specified multiple times; using first specification
[2019-12-04 19:37:09Z] LINK : warning LNK4281: undesirable base address 0x28000000 for x64 image; set base address above 4GB for best ASLR optimization
# Test.obj : error LNK2001: unresolved external symbol PL_curpad
# Test.obj : error LNK2001: unresolved external symbol PL_op
# Test.obj : error LNK2001: unresolved external symbol PL_stack_base
# Test.obj : error LNK2001: unresolved external symbol PL_tainted
# Test.obj : error LNK2001: unresolved external symbol PL_markstack_ptr
# Test.obj : error LNK2001: unresolved external symbol PL_stack_sp
# blib\arch\auto\XS\Test\Test.dll : fatal error LNK1120: 6 unresolved externals
# NMAKE : fatal error U1077: '"C:\Program Files (x86)\Microsoft Visual Studio\2019\Community\VC\Tools\MSVC\14.23.28105\bin\HostX64\x64\link.EXE"' : return code '0x460'
# Other.obj : error LNK2001: unresolved external symbol PL_curpad
# Other.obj : error LNK2001: unresolved external symbol PL_op
# Other.obj : error LNK2001: unresolved external symbol PL_stack_base
# Other.obj : error LNK2001: unresolved external symbol PL_tainted
# Other.obj : error LNK2001: unresolved external symbol PL_markstack_ptr
# Other.obj : error LNK2001: unresolved external symbol PL_stack_sp
# blib\arch\auto\XS\Other\Other.dll : fatal error LNK1120: 6 unresolved externals
[2019-12-04 20:05:04Z] perlio.obj : warning LNK4197: export 'PerlIO_perlio' specified multiple times; using first specification
[2019-12-04 20:05:04Z] perlio.obj : warning LNK4197: export 'PerlIO_pending' specified multiple times; using first specification
[2019-12-04 20:05:04Z] LINK : warning LNK4281: undesirable base address 0x28000000 for x64 image; set base address above 4GB for best ASLR optimization
[2019-12-04 20:05:04Z] c:\perl\smoke\perl\mswin32-win10-blead\build\ext\POSIX\POSIX.xs(1090) : warning C4715: 'my_rint': not all control paths return a value
# Test.obj : error LNK2001: unresolved external symbol PL_markstack
# Test.obj : error LNK2001: unresolved external symbol PL_debug
# blib\arch\auto\XS\Test\Test.dll : fatal error LNK1120: 7 unresolved externals
# Other.obj : error LNK2001: unresolved external symbol PL_markstack
# Other.obj : error LNK2001: unresolved external symbol PL_debug
# blib\arch\auto\XS\Other\Other.dll : fatal error LNK1120: 7 unresolved externals
[2019-12-04 20:42:45Z] perlio.obj : warning LNK4197: export 'PerlIO_pending' specified multiple times; using first specification
[2019-12-04 20:42:45Z] perlio.obj : warning LNK4197: export 'PerlIO_perlio' specified multiple times; using first specification
[2019-12-04 20:42:45Z] LINK : warning LNK4281: undesirable base address 0x28000000 for x64 image; set base address above 4GB for best ASLR optimization
[2019-12-04 21:10:25Z] perlio.obj : warning LNK4197: export 'PerlIO_perlio' specified multiple times; using first specification
[2019-12-04 21:10:25Z] perlio.obj : warning LNK4197: export 'PerlIO_pending' specified multiple times; using first specification
[2019-12-04 21:10:25Z] LINK : warning LNK4281: undesirable base address 0x28000000 for x64 image; set base address above 4GB for best ASLR optimization
[2019-12-04 21:10:25Z] c:\perl\smoke\perl\mswin32-win10-blead\build\ext\POSIX\POSIX.xs(1090) : warning C4715: 'my_rint': not all control paths return a value
[2019-12-04 21:48:12Z] perlio.obj : warning LNK4197: export 'PerlIO_pending' specified multiple times; using first specification
[2019-12-04 21:48:12Z] perlio.obj : warning LNK4197: export 'PerlIO_perlio' specified multiple times; using first specification
[2019-12-04 21:48:12Z] LINK : warning LNK4281: undesirable base address 0x28000000 for x64 image; set base address above 4GB for best ASLR optimization
[2019-12-04 22:23:32Z] perlio.obj : warning LNK4197: export 'PerlIO_perlio' specified multiple times; using first specification
[2019-12-04 22:23:32Z] perlio.obj : warning LNK4197: export 'PerlIO_pending' specified multiple times; using first specification
[2019-12-04 22:23:32Z] LINK : warning LNK4281: undesirable base address 0x28000000 for x64 image; set base address above 4GB for best ASLR optimization
[2019-12-04 22:23:32Z] c:\perl\smoke\perl\mswin32-win10-blead\build\ext\POSIX\POSIX.xs(1090) : warning C4715: 'my_rint': not all control paths return a value
[2019-12-04 23:14:33Z] perlio.obj : warning LNK4197: export 'PerlIO_pending' specified multiple times; using first specification
[2019-12-04 23:14:33Z] perlio.obj : warning LNK4197: export 'PerlIO_perlio' specified multiple times; using first specification
[2019-12-04 23:14:33Z] LINK : warning LNK4281: undesirable base address 0x28000000 for x64 image; set base address above 4GB for best ASLR optimization
[2019-12-04 23:49:57Z] perlio.obj : warning LNK4197: export 'PerlIO_perlio' specified multiple times; using first specification
[2019-12-04 23:49:57Z] perlio.obj : warning LNK4197: export 'PerlIO_pending' specified multiple times; using first specification
[2019-12-04 23:49:57Z] LINK : warning LNK4281: undesirable base address 0x28000000 for x64 image; set base address above 4GB for best ASLR optimization
[2019-12-04 23:49:57Z] c:\perl\smoke\perl\mswin32-win10-blead\build\ext\POSIX\POSIX.xs(1090) : warning C4715: 'my_rint': not all control paths return a value

Non-Fatal messages(MSWin32):

-- 
Report by Test::Smoke v1.72 running on perl 5.28.1
(Reporter v0.053 / Smoker v0.046)



nntp.perl.org: Perl Programming lists via nntp and http.
Comments to Ask Bjørn Hansen at ask@perl.org | Group listing | About