develooper Front page | perl.daily-build.reports | Postings from April 2019

Smoke [blead] v5.29.9-143-g16b9df3ebb PASS netbsd 7.2 (amd64/1 cpu)

From:
Carlos Guevara
Date:
April 17, 2019 09:27
Subject:
Smoke [blead] v5.29.9-143-g16b9df3ebb PASS netbsd 7.2 (amd64/1 cpu)
Message ID:
20190417092746.8A09616C179@cjg-netbsd7
Automated smoke report for branch blead 5.29.10 patch 16b9df3ebb85d9c71d6792b88f6633c04fe4b2c6 v5.29.9-143-g16b9df3ebb
cjg-netbsd7: Intel 686-class (amd64/1 cpu)
    on        netbsd - 7.2
    using     g++ version 4.8.5
    smoketime 4 hours 44 minutes (average 35 minutes 34 seconds)

Summary: PASS

O = OK  F = Failure(s), extended report at the bottom
X = Failure(s) under TEST but not under harness
? = still running or test results not (yet) available
Build failures during:       - = unknown or N/A
c = Configure, m = make, M = make (after miniperl), t = make test-prep

v5.29.9-143-g16b9df3ebb  Configuration (common) -Dcc=g++
----------- ---------------------------------------------------------
O O         
O O         -Duse64bitall
O O         -Duseithreads
O O         -Duseithreads -Duse64bitall
| +--------- -DDEBUGGING
+----------- no debugging


Locally applied patches:
    SMOKE16b9df3ebb85d9c71d6792b88f6633c04fe4b2c6

Testsuite was run only with 'harness'

Tests skipped on user request:
    # One test name on a line
Passed Todo tests: (common-args) -Dcc=g++
[default] 
[default] -DDEBUGGING
[default] -Duse64bitall
[default] -DDEBUGGING -Duse64bitall
[default] -Duseithreads
[default] -DDEBUGGING -Duseithreads
[default] -Duseithreads -Duse64bitall
[default] -DDEBUGGING -Duseithreads -Duse64bitall
../cpan/Module-Metadata/t/extract-version.t.................PASSED
    7, 11, 15, 19, 23, 27, 31, 35, 39, 43, 47
    51, 55, 59, 63, 67, 71, 75, 79, 83, 87
    91, 95, 99, 106, 110, 114, 118, 122, 126
    130, 134, 138, 142, 149, 153, 157, 161
    165, 169, 173, 177, 181, 185, 195, 199
    203

Compiler messages(gcc):
regcomp.c: In function 'void S_pat_upgrade_to_utf8(RExC_state_t*, char**, STRLEN*, int)':
regcomp.c:6614:68: warning: ignoring return value of 'size_t S_variant_under_utf8_count(const U8*, const U8*)', declared with attribute warn_unused_result [-Wunused-result]
perl.h:3445:62: note: in definition of macro 'EXPECT'
perl.h:3450:52: note: in expansion of macro 'cBOOL'
handy.h:2307:9: note: in expansion of macro 'UNLIKELY'
handy.h:2307:18: note: in expansion of macro '_MEM_WRAP_WILL_WRAP'
handy.h:2319:30: note: in expansion of macro 'MEM_WRAP_CHECK'
handy.h:2400:27: note: in expansion of macro 'MEM_WRAP_CHECK_'
regcomp.c:6614:5: note: in expansion of macro 'Newx'
utf8.c: In function 'U8* Perl_bytes_to_utf8(const U8*, STRLEN*)':
utf8.c:2668:55: warning: ignoring return value of 'size_t S_variant_under_utf8_count(const U8*, const U8*)', declared with attribute warn_unused_result [-Wunused-result]
utf8.c:2668:5: note: in expansion of macro 'Newx'
/usr/include/sys/cdefs_elf.h:67:20: error: missing binary operator before token "("
/usr/include/sys/cdefs_elf.h:73:20: error: missing binary operator before token "("
/usr/include/sys/cdefs_elf.h:79:20: error: missing binary operator before token "("
Encode.c: In function 'void XS_Encode_decode(CV*)':
../../XSUB.h:185:20: warning: unused variable 'ix' [-Wunused-variable]
Encode.c:1356:5: note: in expansion of macro 'dXSI32'
Encode.c: In function 'void XS_Encode_encode(CV*)':
Encode.c:1398:5: note: in expansion of macro 'dXSI32'
Socket.c: In function 'void XS_Socket_pack_ip_mreq_source(CV*)':
Socket.c:1654:7: warning: variable 'interface' set but not used [-Wunused-but-set-variable]
const-c.inc:351:1: warning: unused parameter 'iv_return' [-Wunused-parameter]
Piece.xs: In function 'char* _strptime(const char*, const char*, tm*, int*)':
Piece.xs:719:14: warning: 'len' may be used uninitialized in this function [-Wmaybe-uninitialized]
re_comp.c: In function 'void S_pat_upgrade_to_utf8(RExC_state_t*, char**, STRLEN*, int)':
re_comp.c:6614:68: warning: ignoring return value of 'size_t S_variant_under_utf8_count(const U8*, const U8*)', declared with attribute warn_unused_result [-Wunused-result]
../../perl.h:3445:62: note: in definition of macro 'EXPECT'
../../perl.h:3450:52: note: in expansion of macro 'cBOOL'
../../handy.h:2307:9: note: in expansion of macro 'UNLIKELY'
../../handy.h:2307:18: note: in expansion of macro '_MEM_WRAP_WILL_WRAP'
../../handy.h:2319:30: note: in expansion of macro 'MEM_WRAP_CHECK'
../../handy.h:2400:27: note: in expansion of macro 'MEM_WRAP_CHECK_'
re_comp.c:6614:5: note: in expansion of macro 'Newx'
regcomp.c: In function 'void S_pat_upgrade_to_utf8(PerlInterpreter*, RExC_state_t*, char**, STRLEN*, int)':
utf8.c: In function 'U8* Perl_bytes_to_utf8(PerlInterpreter*, const U8*, STRLEN*)':
Encode.c: In function 'void XS_Encode_decode(PerlInterpreter*, CV*)':
Encode.c: In function 'void XS_Encode_encode(PerlInterpreter*, CV*)':
Socket.c: In function 'void XS_Socket_pack_ip_mreq_source(PerlInterpreter*, CV*)':
Piece.xs: In function 'char* _strptime(PerlInterpreter*, const char*, const char*, tm*, int*)':
re_comp.c: In function 'void S_pat_upgrade_to_utf8(PerlInterpreter*, RExC_state_t*, char**, STRLEN*, int)':

Non-Fatal messages(gcc):



-- 
Report by Test::Smoke v1.71 running on perl 5.26.1
(Reporter v0.053 / Smoker v0.046)



nntp.perl.org: Perl Programming lists via nntp and http.
Comments to Ask Bjørn Hansen at ask@perl.org | Group listing | About