develooper Front page | perl.daily-build.reports | Postings from April 2019

Smoke [smoke-me/khw-strtod] v5.29.9-140-g0632ddead6 FAIL(F) netbsd8.0 (amd64/1 cpu)

From:
Carlos Guevara
Date:
April 17, 2019 02:15
Subject:
Smoke [smoke-me/khw-strtod] v5.29.9-140-g0632ddead6 FAIL(F) netbsd8.0 (amd64/1 cpu)
Message ID:
20190417021548.83343293D80@cjg-netbsd8
Automated smoke report for branch smoke-me/khw-strtod 5.29.10 patch 0632ddead63740272293769dbf3b3d5b28e30c55 v5.29.9-140-g0632ddead6
cjg-netbsd8: Intel 686-class (amd64/1 cpu)
    on        netbsd - 8.0
    using     gcc version 5.5.0
    smoketime 5 hours 17 minutes (average 39 minutes 43 seconds)

Summary: FAIL(F)

O = OK  F = Failure(s), extended report at the bottom
X = Failure(s) under TEST but not under harness
? = still running or test results not (yet) available
Build failures during:       - = unknown or N/A
c = Configure, m = make, M = make (after miniperl), t = make test-prep

v5.29.9-140-g0632ddead6  Configuration (common) -Dcc=gcc
----------- ---------------------------------------------------------
O O         
O O         -Duse64bitall
F F         -Duseithreads
F F         -Duseithreads -Duse64bitall
| +--------- -DDEBUGGING
+----------- no debugging


Locally applied patches:
    SMOKE0632ddead63740272293769dbf3b3d5b28e30c55

Testsuite was run only with 'harness'

Tests skipped on user request:
    # One test name on a line
Failures: (common-args) -Dcc=gcc
[default] -Duseithreads
[default] -Duseithreads -Duse64bitall
../lib/locale.t.............................................FAILED
    Non-zero exit status: 29
    No plan found in TAP output

[default] -DDEBUGGING -Duseithreads
[default] -DDEBUGGING -Duseithreads -Duse64bitall
../lib/locale.t.............................................FAILED
    No plan found in TAP output

Passed Todo tests: (common-args) -Dcc=gcc
[default] 
[default] -DDEBUGGING
[default] -Duse64bitall
[default] -DDEBUGGING -Duse64bitall
[default] -Duseithreads
[default] -DDEBUGGING -Duseithreads
[default] -Duseithreads -Duse64bitall
[default] -DDEBUGGING -Duseithreads -Duse64bitall
../cpan/Module-Metadata/t/extract-version.t.................PASSED
    7, 11, 15, 19, 23, 27, 31, 35, 39, 43, 47
    51, 55, 59, 63, 67, 71, 75, 79, 83, 87
    91, 95, 99, 106, 110, 114, 118, 122, 126
    130, 134, 138, 142, 149, 153, 157, 161
    165, 169, 173, 177, 181, 185, 195, 199
    203

Compiler messages(gcc):
/usr/include/sys/cdefs_elf.h:67:20: error: missing binary operator before token "("
/usr/include/sys/cdefs_elf.h:73:20: error: missing binary operator before token "("
/usr/include/sys/cdefs_elf.h:79:20: error: missing binary operator before token "("
Encode.c: In function 'XS_Encode_decode':
../../XSUB.h:185:20: warning: unused variable 'ix' [-Wunused-variable]
Encode.c:1356:5: note: in expansion of macro 'dXSI32'
Encode.c: In function 'XS_Encode_encode':
Encode.c:1398:5: note: in expansion of macro 'dXSI32'
Socket.c: In function 'XS_Socket_pack_ip_mreq_source':
Socket.c:1654:7: warning: variable 'interface' set but not used [-Wunused-but-set-variable]
const-c.inc: In function 'constant_19':
const-c.inc:351:42: warning: unused parameter 'iv_return' [-Wunused-parameter]

Non-Fatal messages(gcc):



-- 
Report by Test::Smoke v1.71 running on perl 5.26.1
(Reporter v0.053 / Smoker v0.046)



nntp.perl.org: Perl Programming lists via nntp and http.
Comments to Ask Bjørn Hansen at ask@perl.org | Group listing | About