develooper Front page | perl.daily-build.reports | Postings from April 2019

Smoke [smoke-me/leont/less-fragile-encoding] v5.29.9-60-g65f68236d8FAIL(FM) linux 4.20.13-200.fc29.x86_64 [Fedora 29 (x86_64/1 cpu[8 cores]){smoke-me_clang_sanitize=address}

From:
George Greer
Date:
April 17, 2019 00:49
Subject:
Smoke [smoke-me/leont/less-fragile-encoding] v5.29.9-60-g65f68236d8FAIL(FM) linux 4.20.13-200.fc29.x86_64 [Fedora 29 (x86_64/1 cpu[8 cores]){smoke-me_clang_sanitize=address}
Message ID:
201904170048.x3H0mUcW020223@vier.local
Enabled stack-use-after-return (Linux/Darwin) and leak-detection (Linux).  Smoke logs available at http://m-l.org/~perl/smoke/perl/linux/smoke-me_clang_sanitize=address/Leon%20Timmermans/log65f68236d898ea18a459f68f48e1626b140d6964.log.gz

Automated smoke report for branch smoke-me/leont/less-fragile-encoding 5.2910 patch 65f68236d898ea18a459f68f48e1626b140d6964 v5.29.9-60-g65f68236d8
vier.local: Intel(R) Core(TM) i7-3820 CPU @ 3.60GHz (GenuineIntel 3702MHz) (x86_64/1 cpu[8 cores])
    on        linux - 4.20.13-200.fc29.x86_64 [Fedora 29 (Server Edition)]
    using     clang version 4.2.1 Compatible Clang 7.0.1 (Fedora 7.0.1-6.fc29)
    smoketime 3 days 12 hours 12 minutes (average 5 hours 15 minutes)

Summary: FAIL(FM)

O = OK  F = Failure(s), extended report at the bottom
X = Failure(s) under TEST but not under harness
? = still running or test results not (yet) available
Build failures during:       - = unknown or N/A
c = Configure, m = make, M = make (after miniperl), t = make test-prep

v5.29.9-60-g65f68236d8  Configuration (common) -Accflags="-Werror=declaration-after-statement -g -fno-omit-frame-pointer -fsanitize=address  -fno-common -fsanitize-blacklist=`pwd`/asan_ignore" -Aldflags="-fsanitize=address" -Dcc=clang
----------- ---------------------------------------------------------
F F F F F F 
F F F F F F -Accflags=-DPERL_POISON
M - - F F F -Duse64bitall -Accflags=-DPERL_GLOBAL_STRUCT
M - - M - - -Dusemorebits -Accflags=-DPERL_GLOBAL_STRUCT_PRIVATE
M - - F F F -Duseithreads
M - - F F F -Duseithreads -Accflags=-DPERL_POISON
M - - F F F -Duseithreads -Duse64bitall -Accflags=-DPERL_GLOBAL_STRUCT
M - - M - - -Duseithreads -Dusemorebits -Accflags=-DPERL_GLOBAL_STRUCT_PRIVATE
| | | | | +- LC_ALL = en_US.utf8 -DDEBUGGING
| | | | +--- PERLIO = perlio -DDEBUGGING
| | | +----- PERLIO = stdio  -DDEBUGGING
| | +------- LC_ALL = en_US.utf8
| +--------- PERLIO = perlio
+----------- PERLIO = stdio 

Locally applied patches:
    SMOKE65f68236d898ea18a459f68f48e1626b140d6964

Failures: (common-args) -Accflags="-Werror=declaration-after-statement -g -fno-omit-frame-pointer -fsanitize=address  -fno-common -fsanitize-blacklist=`pwd`/asan_ignore" -Aldflags="-fsanitize=address" -Dcc=clang
[stdio] 
    ../ext/XS-APItest/t/stmtasexpr.t............................FAILED
        Non-zero exit status: 1
    ../ext/XS-APItest/t/load-module.t...........................FAILED
        Non-zero exit status: 1
    ../ext/XS-APItest/t/swaplabel.t.............................FAILED
        Non-zero exit status: 1
    ../lib/warnings.t...........................................FAILED
        149-150
    ../lib/locale.t.............................................FAILED
        Non-zero exit status: 1

[perlio] 
    ../ext/XS-APItest/t/load-module.t...........................FAILED
        Non-zero exit status: 1
    ../ext/XS-APItest/t/stmtasexpr.t............................FAILED
        Non-zero exit status: 1
    ../ext/XS-APItest/t/swaplabel.t.............................FAILED
        Non-zero exit status: 1
    ../lib/warnings.t...........................................FAILED
        149-150
    ../lib/locale.t.............................................FAILED
        Non-zero exit status: 1

[en_US.utf8] 
    ../ext/XS-APItest/t/stmtasexpr.t............................FAILED
        Non-zero exit status: 1
    ../ext/XS-APItest/t/load-module.t...........................FAILED
        Non-zero exit status: 1
    ../ext/XS-APItest/t/swaplabel.t.............................FAILED
        Non-zero exit status: 1
    ../lib/locale.t.............................................FAILED
        Non-zero exit status: 1

[stdio] -DDEBUGGING
    ../ext/XS-APItest/t/stmtasexpr.t............................FAILED
        Non-zero exit status: 1
    ../ext/XS-APItest/t/load-module.t...........................FAILED
        Non-zero exit status: 1
    ../dist/Storable/t/blessed.t................................FAILED
        Non-zero exit status: 1
    ../ext/XS-APItest/t/swaplabel.t.............................FAILED
        Non-zero exit status: 1
    ../t/op/while.t.............................................FAILED
        26
    ../t/op/coresubs.t..........................................FAILED
        Non-zero exit status: 1
    ../t/op/coreamp.t...........................................FAILED
        Non-zero exit status: 1
    ../lib/warnings.t...........................................FAILED
        149-150
    ../lib/locale.t.............................................FAILED
        Non-zero exit status: 1

[perlio] -DDEBUGGING
    ../ext/XS-APItest/t/stmtasexpr.t............................FAILED
        Non-zero exit status: 1
    ../ext/XS-APItest/t/load-module.t...........................FAILED
        Non-zero exit status: 1
    ../ext/XS-APItest/t/swaplabel.t.............................FAILED
        Non-zero exit status: 1
    ../t/op/while.t.............................................FAILED
        26
    ../t/op/coresubs.t..........................................FAILED
        Non-zero exit status: 1
    ../t/op/coreamp.t...........................................FAILED
        Non-zero exit status: 1
    ../dist/Storable/t/blessed.t................................FAILED
        Non-zero exit status: 1
    ../lib/locale.t.............................................FAILED
        Non-zero exit status: 1
    ../lib/warnings.t...........................................FAILED
        149-150

[en_US.utf8] -DDEBUGGING
    ../ext/XS-APItest/t/load-module.t...........................FAILED
        Non-zero exit status: 1
    ../t/op/while.t.............................................FAILED
        26
    ../dist/Storable/t/blessed.t................................FAILED
        Non-zero exit status: 1
    ../ext/XS-APItest/t/stmtasexpr.t............................FAILED
        Non-zero exit status: 1
    ../ext/XS-APItest/t/swaplabel.t.............................FAILED
        Non-zero exit status: 1
    ../t/op/coresubs.t..........................................FAILED
        Non-zero exit status: 1
    ../t/op/coreamp.t...........................................FAILED
        Non-zero exit status: 1
    ../lib/locale.t.............................................FAILED
        Non-zero exit status: 1

[stdio/perlio] -Accflags=-DPERL_POISON
    ../ext/XS-APItest/t/stmtasexpr.t............................FAILED
        Non-zero exit status: 1
    ../ext/XS-APItest/t/load-module.t...........................FAILED
        Non-zero exit status: 1
    ../ext/XS-Typemap/t/Typemap.t...............................FAILED
        Non-zero exit status: 1
    ../ext/XS-APItest/t/swaplabel.t.............................FAILED
        Non-zero exit status: 1
    ../lib/warnings.t...........................................FAILED
        149-150
    ../lib/locale.t.............................................FAILED
        Non-zero exit status: 1

[en_US.utf8] -Accflags=-DPERL_POISON
    ../ext/XS-APItest/t/stmtasexpr.t............................FAILED
        Non-zero exit status: 1
    ../ext/XS-APItest/t/load-module.t...........................FAILED
        Non-zero exit status: 1
    ../ext/XS-APItest/t/swaplabel.t.............................FAILED
        Non-zero exit status: 1
    ../ext/XS-Typemap/t/Typemap.t...............................FAILED
        Non-zero exit status: 1
    ../lib/locale.t.............................................FAILED
        Non-zero exit status: 1

[stdio] -DDEBUGGING -Accflags=-DPERL_POISON
    ../ext/XS-APItest/t/load-module.t...........................FAILED
        Non-zero exit status: 1
    ../ext/XS-APItest/t/stmtasexpr.t............................FAILED
        Non-zero exit status: 1
    ../dist/Storable/t/blessed.t................................FAILED
        Non-zero exit status: 1
    ../ext/XS-APItest/t/swaplabel.t.............................FAILED
        Non-zero exit status: 1
    ../ext/XS-Typemap/t/Typemap.t...............................FAILED
        Non-zero exit status: 1
    ../t/op/while.t.............................................FAILED
        26
    ../t/op/coreamp.t...........................................FAILED
        Non-zero exit status: 1
    ../t/op/coresubs.t..........................................FAILED
        Non-zero exit status: 1
    ../lib/warnings.t...........................................FAILED
        149-150
    ../lib/locale.t.............................................FAILED
        Non-zero exit status: 1

[perlio] -DDEBUGGING -Accflags=-DPERL_POISON
    ../ext/XS-APItest/t/stmtasexpr.t............................FAILED
        Non-zero exit status: 1
    ../dist/Storable/t/blessed.t................................FAILED
        Non-zero exit status: 1
    ../ext/XS-APItest/t/load-module.t...........................FAILED
        Non-zero exit status: 1
    ../ext/XS-Typemap/t/Typemap.t...............................FAILED
        Non-zero exit status: 1
    ../ext/XS-APItest/t/swaplabel.t.............................FAILED
        Non-zero exit status: 1
    ../t/op/while.t.............................................FAILED
        26
    ../t/op/coreamp.t...........................................FAILED
        Non-zero exit status: 1
    ../t/op/coresubs.t..........................................FAILED
        Non-zero exit status: 1
    ../lib/warnings.t...........................................FAILED
        149-150
    ../lib/locale.t.............................................FAILED
        Non-zero exit status: 1

[en_US.utf8] -DDEBUGGING -Accflags=-DPERL_POISON
    ../dist/Storable/t/blessed.t................................FAILED
        Non-zero exit status: 1
    ../ext/XS-APItest/t/stmtasexpr.t............................FAILED
        Non-zero exit status: 1
    ../ext/XS-APItest/t/load-module.t...........................FAILED
        Non-zero exit status: 1
    ../ext/XS-APItest/t/swaplabel.t.............................FAILED
        Non-zero exit status: 1
    ../ext/XS-Typemap/t/Typemap.t...............................FAILED
        Non-zero exit status: 1
    ../t/op/while.t.............................................FAILED
        26
    ../t/op/coreamp.t...........................................FAILED
        Non-zero exit status: 1
    ../t/op/coresubs.t..........................................FAILED
        Non-zero exit status: 1
    ../lib/locale.t.............................................FAILED
        Non-zero exit status: 1
Inconsistent test results (between TEST and harness):
    ../ext/File-Glob/t/rt131211.t........... ...................................... FAILED at test 2

[stdio] -DDEBUGGING -Duse64bitall -Accflags=-DPERL_GLOBAL_STRUCT
    ../ext/XS-APItest/t/load-module.t...........................FAILED
        Non-zero exit status: 1
    ../ext/XS-APItest/t/stmtasexpr.t............................FAILED
        Non-zero exit status: 1
    ../dist/Storable/t/blessed.t................................FAILED
        Non-zero exit status: 1
    ../t/op/while.t.............................................FAILED
        26
    ../ext/XS-APItest/t/swaplabel.t.............................FAILED
        Non-zero exit status: 1
    ../t/op/coresubs.t..........................................FAILED
        Non-zero exit status: 1
    ../t/op/coreamp.t...........................................FAILED
        Non-zero exit status: 1
    ../t/porting/libperl.t......................................FAILED
        8, 10
    ../lib/warnings.t...........................................FAILED
        149-150
    ../lib/locale.t.............................................FAILED
        Non-zero exit status: 1

[perlio] -DDEBUGGING -Duse64bitall -Accflags=-DPERL_GLOBAL_STRUCT
    ../ext/XS-APItest/t/stmtasexpr.t............................FAILED
        Non-zero exit status: 1
    ../ext/XS-APItest/t/load-module.t...........................FAILED
        Non-zero exit status: 1
    ../dist/Storable/t/blessed.t................................FAILED
        Non-zero exit status: 1
    ../t/op/while.t.............................................FAILED
        26
    ../ext/XS-APItest/t/swaplabel.t.............................FAILED
        Non-zero exit status: 1
    ../t/op/coresubs.t..........................................FAILED
        Non-zero exit status: 1
    ../t/op/coreamp.t...........................................FAILED
        Non-zero exit status: 1
    ../t/porting/libperl.t......................................FAILED
        8, 10
    ../lib/warnings.t...........................................FAILED
        149-150
    ../lib/locale.t.............................................FAILED
        Non-zero exit status: 1

[en_US.utf8] -DDEBUGGING -Duse64bitall -Accflags=-DPERL_GLOBAL_STRUCT
    ../t/op/while.t.............................................FAILED
        26
    ../ext/XS-APItest/t/stmtasexpr.t............................FAILED
        Non-zero exit status: 1
    ../ext/XS-APItest/t/load-module.t...........................FAILED
        Non-zero exit status: 1
    ../dist/Storable/t/blessed.t................................FAILED
        Non-zero exit status: 1
    ../ext/XS-APItest/t/swaplabel.t.............................FAILED
        Non-zero exit status: 1
    ../t/op/coreamp.t...........................................FAILED
        Non-zero exit status: 1
    ../t/op/coresubs.t..........................................FAILED
        Non-zero exit status: 1
    ../t/porting/libperl.t......................................FAILED
        8, 10
    ../lib/locale.t.............................................FAILED
        Non-zero exit status: 1

[stdio/perlio] -DDEBUGGING -Duseithreads
    ../ext/XS-APItest/t/load-module.t...........................FAILED
        Non-zero exit status: 1
    ../dist/Storable/t/blessed.t................................FAILED
        Non-zero exit status: 1
    ../ext/XS-APItest/t/stmtasexpr.t............................FAILED
        Non-zero exit status: 1
    ../ext/XS-APItest/t/swaplabel.t.............................FAILED
        Non-zero exit status: 1
    ../t/op/while.t.............................................FAILED
        26
    ../t/op/coreamp.t...........................................FAILED
        Non-zero exit status: 1
    ../t/op/coresubs.t..........................................FAILED
        Non-zero exit status: 1
    ../lib/locale_threads.t.....................................FAILED
        2
    ../lib/warnings.t...........................................FAILED
        149-150
    ../lib/locale.t.............................................FAILED
        Non-zero exit status: 1

[en_US.utf8] -DDEBUGGING -Duseithreads
    ../ext/XS-APItest/t/stmtasexpr.t............................FAILED
        Non-zero exit status: 1
    ../ext/XS-APItest/t/load-module.t...........................FAILED
        Non-zero exit status: 1
    ../dist/Storable/t/blessed.t................................FAILED
        Non-zero exit status: 1
    ../ext/XS-APItest/t/swaplabel.t.............................FAILED
        Non-zero exit status: 1
    ../t/op/while.t.............................................FAILED
        26
    ../t/op/coreamp.t...........................................FAILED
        Non-zero exit status: 1
    ../lib/locale_threads.t.....................................FAILED
        2
    ../t/op/coresubs.t..........................................FAILED
        Non-zero exit status: 1
    ../lib/warnings.t...........................................FAILED
        149-150
    ../lib/locale.t.............................................FAILED
        Non-zero exit status: 1

[stdio] -DDEBUGGING -Duseithreads -Accflags=-DPERL_POISON
    ../ext/XS-APItest/t/stmtasexpr.t............................FAILED
        Non-zero exit status: 1
    ../dist/Storable/t/blessed.t................................FAILED
        Non-zero exit status: 1
    ../ext/XS-APItest/t/load-module.t...........................FAILED
        Non-zero exit status: 1
    ../ext/XS-Typemap/t/Typemap.t...............................FAILED
        Non-zero exit status: 1
    ../ext/XS-APItest/t/swaplabel.t.............................FAILED
        Non-zero exit status: 1
    ../t/op/while.t.............................................FAILED
        26
    ../t/op/coreamp.t...........................................FAILED
        Non-zero exit status: 1
    ../t/op/coresubs.t..........................................FAILED
        Non-zero exit status: 1
    ../lib/locale_threads.t.....................................FAILED
        2
    ../lib/warnings.t...........................................FAILED
        149-150
    ../lib/locale.t.............................................FAILED
        Non-zero exit status: 1

[perlio] -DDEBUGGING -Duseithreads -Accflags=-DPERL_POISON
    ../dist/Storable/t/blessed.t................................FAILED
        Non-zero exit status: 1
    ../ext/XS-APItest/t/stmtasexpr.t............................FAILED
        Non-zero exit status: 1
    ../ext/XS-APItest/t/load-module.t...........................FAILED
        Non-zero exit status: 1
    ../ext/XS-Typemap/t/Typemap.t...............................FAILED
        Non-zero exit status: 1
    ../ext/XS-APItest/t/swaplabel.t.............................FAILED
        Non-zero exit status: 1
    ../t/op/while.t.............................................FAILED
        26
    ../t/op/coreamp.t...........................................FAILED
        Non-zero exit status: 1
    ../t/op/coresubs.t..........................................FAILED
        Non-zero exit status: 1
    ../lib/locale_threads.t.....................................FAILED
        2
    ../lib/warnings.t...........................................FAILED
        149-150
    ../lib/locale.t.............................................FAILED
        Non-zero exit status: 1

[en_US.utf8] -DDEBUGGING -Duseithreads -Accflags=-DPERL_POISON
    ../ext/XS-APItest/t/stmtasexpr.t............................FAILED
        Non-zero exit status: 1
    ../ext/XS-APItest/t/load-module.t...........................FAILED
        Non-zero exit status: 1
    ../dist/Storable/t/blessed.t................................FAILED
        Non-zero exit status: 1
    ../ext/XS-APItest/t/swaplabel.t.............................FAILED
        Non-zero exit status: 1
    ../ext/XS-Typemap/t/Typemap.t...............................FAILED
        Non-zero exit status: 1
    ../t/op/while.t.............................................FAILED
        26
    ../t/op/coresubs.t..........................................FAILED
        Non-zero exit status: 1
    ../t/op/coreamp.t...........................................FAILED
        Non-zero exit status: 1
    ../lib/locale_threads.t.....................................FAILED
        2
    ../lib/warnings.t...........................................FAILED
        149-150
    ../lib/locale.t.............................................FAILED
        Non-zero exit status: 1

[stdio] -DDEBUGGING -Duseithreads -Duse64bitall -Accflags=-DPERL_GLOBAL_STRUCT
    ../ext/XS-APItest/t/load-module.t...........................FAILED
        Non-zero exit status: 1
    ../dist/Storable/t/blessed.t................................FAILED
        Non-zero exit status: 1
    ../ext/XS-APItest/t/stmtasexpr.t............................FAILED
        Non-zero exit status: 1
    ../ext/XS-APItest/t/swaplabel.t.............................FAILED
        Non-zero exit status: 1
    ../t/op/while.t.............................................FAILED
        26
    ../t/op/coresubs.t..........................................FAILED
        Non-zero exit status: 1
    ../t/porting/libperl.t......................................FAILED
        8, 10
    ../t/op/coreamp.t...........................................FAILED
        Non-zero exit status: 1
    ../lib/locale_threads.t.....................................FAILED
        2
    ../lib/warnings.t...........................................FAILED
        149-150
    ../lib/locale.t.............................................FAILED
        Non-zero exit status: 1

[perlio/en_US.utf8] -DDEBUGGING -Duseithreads -Duse64bitall -Accflags=-DPERL_GLOBAL_STRUCT
    ../ext/XS-APItest/t/stmtasexpr.t............................FAILED
        Non-zero exit status: 1
    ../ext/XS-APItest/t/load-module.t...........................FAILED
        Non-zero exit status: 1
    ../dist/Storable/t/blessed.t................................FAILED
        Non-zero exit status: 1
    ../ext/XS-APItest/t/swaplabel.t.............................FAILED
        Non-zero exit status: 1
    ../t/op/while.t.............................................FAILED
        26
    ../t/op/coreamp.t...........................................FAILED
        Non-zero exit status: 1
    ../t/op/coresubs.t..........................................FAILED
        Non-zero exit status: 1
    ../lib/locale_threads.t.....................................FAILED
        2
    ../t/porting/libperl.t......................................FAILED
        8, 10
    ../lib/warnings.t...........................................FAILED
        149-150
    ../lib/locale.t.............................................FAILED
        Non-zero exit status: 1

Compiler messages(gcc):
Encode.c:1356:5: warning: unused variable 'ix' [-Wunused-variable]
../../XSUB.h:185:20: note: expanded from macro 'dXSI32'
Encode.c:1398:5: warning: unused variable 'ix' [-Wunused-variable]
./const-xs.inc:128:42: warning: AI_IDN_ALLOW_UNASSIGNED is deprecated [-W#pragma-messages]
/usr/include/netdb.h:609:3: note: expanded from macro 'AI_IDN_ALLOW_UNASSIGNED'
/usr/include/sys/cdefs.h:485:3: note: expanded from macro '__glibc_macro_warning'
/usr/include/sys/cdefs.h:483:42: note: expanded from macro '__glibc_macro_warning1'
<scratch space>:114:6: note: expanded from here
./const-xs.inc:131:46: warning: AI_IDN_USE_STD3_ASCII_RULES is deprecated [-W#pragma-messages]
/usr/include/netdb.h:611:3: note: expanded from macro 'AI_IDN_USE_STD3_ASCII_RULES'
<scratch space>:117:6: note: expanded from here
./const-xs.inc:383:42: warning: NI_IDN_ALLOW_UNASSIGNED is deprecated [-W#pragma-messages]
/usr/include/netdb.h:650:3: note: expanded from macro 'NI_IDN_ALLOW_UNASSIGNED'
<scratch space>:120:6: note: expanded from here
./const-xs.inc:386:46: warning: NI_IDN_USE_STD3_ASCII_RULES is deprecated [-W#pragma-messages]
/usr/include/netdb.h:652:3: note: expanded from macro 'NI_IDN_USE_STD3_ASCII_RULES'
<scratch space>:123:6: note: expanded from here

Non-Fatal messages(gcc):

-- 
Report by Test::Smoke v1.72 running on perl 5.28.1
(Reporter v0.053 / Smoker v0.046)



nntp.perl.org: Perl Programming lists via nntp and http.
Comments to Ask Bjørn Hansen at ask@perl.org | Group listing | About