develooper Front page | perl.daily-build.reports | Postings from August 2018

Smoke [blead] v5.29.1-86-g48ae8dc39c FAIL(F) netbsd 6.1.5 (amd64/1cpu)

From:
Carlos Guevara
Date:
August 12, 2018 20:27
Subject:
Smoke [blead] v5.29.1-86-g48ae8dc39c FAIL(F) netbsd 6.1.5 (amd64/1cpu)
Message ID:
13501_1534105618_5B70980E_13501_16_1_20180812202640.7B01B133353@cjg-netbsd6
Automated smoke report for branch blead 5.29.2 patch 48ae8dc39c5996cfd74bb0fefa5026f48ef8445e v5.29.1-86-g48ae8dc39c
cjg-netbsd6: Intel 686-class (amd64/1 cpu)
    on        netbsd - 6.1.5
    using     cc version 4.5.3
    smoketime 4 hours 22 minutes (average 32 minutes 48 seconds)

Summary: FAIL(F)

O = OK  F = Failure(s), extended report at the bottom
X = Failure(s) under TEST but not under harness
? = still running or test results not (yet) available
Build failures during:       - = unknown or N/A
c = Configure, m = make, M = make (after miniperl), t = make test-prep

v5.29.1-86-g48ae8dc39c  Configuration (common) none
----------- ---------------------------------------------------------
F F         
F F         -Duse64bitall
F F         -Duseithreads
F F         -Duseithreads -Duse64bitall
| +--------- -DDEBUGGING
+----------- no debugging


Locally applied patches:
    SMOKE48ae8dc39c5996cfd74bb0fefa5026f48ef8445e

Testsuite was run only with 'harness'

Tests skipped on user request:
    # One test name on a line
Failures: (common-args) none
[default] 
[default] -DDEBUGGING
[default] -Duse64bitall
[default] -DDEBUGGING -Duse64bitall
[default] -Duseithreads
[default] -DDEBUGGING -Duseithreads
[default] -Duseithreads -Duse64bitall
[default] -DDEBUGGING -Duseithreads -Duse64bitall
../t/run/locale.t...........................................FAILED
    37
../lib/locale.t.............................................FAILED
    445-446, 450, 453, 467

Compiler messages(gcc):
op.c: In function 'S_gen_constant_list':
op.c:5658:31: warning: argument 'o' might be clobbered by 'longjmp' or 'vfork'
toke.c: In function 'Perl_scan_num':
toke.c:11098:24: warning: 'b' may be used uninitialized in this function
pp.c: In function 'Perl_pp_argelem':
pp.c:6780:13: warning: value computed is not used
pp_sys.c: In function 'Perl_pp_stat':
pp_sys.c:2997:6: warning: comparison of unsigned expression < 0 is always false
doio.c: In function 'S_argvout_free':
doio.c:1197:21: warning: implicit declaration of function 'unlinkat'
doio.c: In function 'Perl_do_close':
doio.c:1618:21: warning: implicit declaration of function 'linkat'
doio.c:1631:25: warning: implicit declaration of function 'renameat'
doio.c: In function 'Perl_do_msgsnd':
doio.c:3033:25: warning: defining a type in a cast is invalid in C++
doio.c: In function 'Perl_do_msgrcv':
doio.c:3071:26: warning: defining a type in a cast is invalid in C++
perl.h:7171:19: warning: non-local variable 'PL_inf' with anonymous type is questionable in C++
perl.h:7207:19: warning: non-local variable 'PL_nan' with anonymous type is questionable in C++
perlio.c: In function 'PerlIOStdio_set_ptrcnt':
perlio.c:3599:2: warning: pointer targets in assignment differ in signedness
/usr/include/sys/cdefs_elf.h:67:20: error: missing binary operator before token "("
/usr/include/sys/cdefs_elf.h:73:20: error: missing binary operator before token "("
RealPPPort.xs: In function 'XS_Devel__PPPort_check_HeUTF8':
RealPPPort.xs:1817:17: warning: value computed is not used
POSIX.xs:1062:11: warning: 'my_rint' defined but not used
const-c.inc: In function 'constant_19':
const-c.inc:351:42: warning: unused parameter 'iv_return'
shared.xs: In function 'sharedsv_array_mg_CLEAR':
shared.xs:1103:17: warning: 'iter' may be used uninitialized in this function

Non-Fatal messages(gcc):



-- 
Report by Test::Smoke v1.71 running on perl 5.26.1
(Reporter v0.053 / Smoker v0.046)



nntp.perl.org: Perl Programming lists via nntp and http.
Comments to Ask Bjørn Hansen at ask@perl.org | Group listing | About