develooper Front page | perl.daily-build.reports | Postings from July 2018

Smoke [blead] v5.29.0-87-ga13f1de4e3 FAIL(XF) dragonfly 5.2-RELEASE(x86_64/2 cpu)

From:
Tomasz Konojacki
Date:
July 13, 2018 09:29
Subject:
Smoke [blead] v5.29.0-87-ga13f1de4e3 FAIL(XF) dragonfly 5.2-RELEASE(x86_64/2 cpu)
Message ID:
7591_1531474145_5B4870E0_7591_2_1_5b486fa2.113350.792e0ba@boettgerilla-pallens.xenu.pl
Automated smoke report for branch blead 5.29.1 patch a13f1de4e34633a275aa79d4e7874c2796bc0417 v5.29.0-87-ga13f1de4e3
boettgerilla-pallens.xenu.pl: Intel(R) Xeon(R) CPU E3-1275 V2 @ 3.50GHz (x86_64/2 cpu)
    on        dragonfly - 5.2-RELEASE
    using     cc version 5.4.1 [DragonFly] Release/2016-08-27
    smoketime 5 hours 16 minutes (average 39 minutes 33 seconds)

Summary: FAIL(XF)

O = OK  F = Failure(s), extended report at the bottom
X = Failure(s) under TEST but not under harness
? = still running or test results not (yet) available
Build failures during:       - = unknown or N/A
c = Configure, m = make, M = make (after miniperl), t = make test-prep

v5.29.0-87-ga13f1de4e3  Configuration (common) none
----------- ---------------------------------------------------------
O O O O     
O O O O     -Duselongdouble
F O F X     -Duseithreads
F X F X     -Duseithreads -Duselongdouble
| | | +----- PERLIO = perlio -DDEBUGGING
| | +------- PERLIO = stdio  -DDEBUGGING
| +--------- PERLIO = perlio
+----------- PERLIO = stdio


Locally applied patches:
    SMOKEa13f1de4e34633a275aa79d4e7874c2796bc0417

Tests skipped on user request:
    # One test name on a line
Failures: (common-args) none
[stdio] -Duseithreads
[stdio] -Duseithreads -Duselongdouble
[stdio] -DDEBUGGING -Duseithreads -Duselongdouble
    ../ext/XS-APItest/t/handy00.t...............................FAILED
        No plan found in TAP output
Inconsistent test results (between TEST and harness):
    ../cpan/Sys-Syslog/t/syslog.t........... ....................................... FAILED at test 144

[stdio] -DDEBUGGING -Duseithreads
    ../ext/XS-APItest/t/handy00.t...............................FAILED
        No plan found in TAP output
Inconsistent test results (between TEST and harness):
    ../cpan/Sys-Syslog/t/syslog.t........... ....................................... FAILED at test 190

[perlio] -DDEBUGGING -Duseithreads
Inconsistent test results (between TEST and harness):
    ../cpan/Sys-Syslog/t/syslog.t........... ....................................... FAILED at test 190

[perlio] -Duseithreads -Duselongdouble
[perlio] -DDEBUGGING -Duseithreads -Duselongdouble
Inconsistent test results (between TEST and harness):
    ../cpan/Sys-Syslog/t/syslog.t........... ....................................... FAILED at test 144

Compiler messages(dragonfly):


Non-Fatal messages(dragonfly):



-- 
Report by Test::Smoke v1.71 running on perl 5.26.1
(Reporter v0.053 / Smoker v0.046)



nntp.perl.org: Perl Programming lists via nntp and http.
Comments to Ask Bjørn Hansen at ask@perl.org | Group listing | About