develooper Front page | perl.daily-build.reports | Postings from July 2018

Smoke [blead] v5.29.0-87-ga13f1de4e3 FAIL(F) netbsd 8.0_RC2 (amd64/1cpu)

From:
Carlos Guevara
Date:
July 12, 2018 00:47
Subject:
Smoke [blead] v5.29.0-87-ga13f1de4e3 FAIL(F) netbsd 8.0_RC2 (amd64/1cpu)
Message ID:
14877_1531356451_5B46A522_14877_187_1_20180712003644.87C584A046@cjg-netbsd8
Automated smoke report for branch blead 5.29.1 patch a13f1de4e34633a275aa79d4e7874c2796bc0417 v5.29.0-87-ga13f1de4e3
cjg-netbsd8: Intel 686-class (amd64/1 cpu)
    on        netbsd - 8.0_RC2
    using     cc version 5.5.0
    smoketime 4 hours 23 minutes (average 32 minutes 54 seconds)

Summary: FAIL(F)

O = OK  F = Failure(s), extended report at the bottom
X = Failure(s) under TEST but not under harness
? = still running or test results not (yet) available
Build failures during:       - = unknown or N/A
c = Configure, m = make, M = make (after miniperl), t = make test-prep

v5.29.0-87-ga13f1de4e3  Configuration (common) none
----------- ---------------------------------------------------------
F O         
O O         -Duse64bitall
O O         -Duseithreads
O O         -Duseithreads -Duse64bitall
| +--------- -DDEBUGGING
+----------- no debugging


Locally applied patches:
    SMOKEa13f1de4e34633a275aa79d4e7874c2796bc0417

Testsuite was run only with 'harness'

Tests skipped on user request:
    # One test name on a line
Failures: (common-args) none
[default] 
../dist/Time-HiRes/t/usleep.t...............................FAILED
    3-4
    Non-zero exit status: 2

Compiler messages(gcc):
toke.c: In function 'Perl_yylex':
utf8.h:442:43: warning: 'uv' may be used uninitialized in this function [-Wmaybe-uninitialized]
inline.h:1805:8: note: 'uv' was declared here
/usr/include/sys/cdefs_elf.h:67:20: error: missing binary operator before token "("
/usr/include/sys/cdefs_elf.h:73:20: error: missing binary operator before token "("
/usr/include/sys/cdefs_elf.h:79:20: error: missing binary operator before token "("
Socket.c: In function 'XS_Socket_pack_ip_mreq_source':
Socket.c:1654:7: warning: variable 'interface' set but not used [-Wunused-but-set-variable]
const-c.inc: In function 'constant_19':
const-c.inc:351:42: warning: unused parameter 'iv_return' [-Wunused-parameter]

Non-Fatal messages(gcc):



-- 
Report by Test::Smoke v1.71 running on perl 5.26.1
(Reporter v0.053 / Smoker v0.046)



nntp.perl.org: Perl Programming lists via nntp and http.
Comments to Ask Bjørn Hansen at ask@perl.org | Group listing | About