develooper Front page | perl.daily-build.reports | Postings from June 2018

Smoke [blead] v5.28.0-RC2-2-g197e7984e9 FAIL(F) HP-UX B.11.11/64(PA-RISC2.0/64/2 cpu)

Thread Previous
From:
H.Merijn Brand
Date:
June 11, 2018 11:47
Subject:
Smoke [blead] v5.28.0-RC2-2-g197e7984e9 FAIL(F) HP-UX B.11.11/64(PA-RISC2.0/64/2 cpu)
Message ID:
22781_1528717653_5B1E614B_22781_29_1_20180611114712.DBF8866FFA@xx1.develooper.com
Automated smoke report for branch blead 5.28.0 patch 197e7984e9f640254af80f8553707bad217f3814 v5.28.0-RC2-2-g197e7984e9
r3: PA8800 (PA-RISC2.0/64/2 cpu)
    on        HP-UX - B.11.11/64
    using     gcc version 4.6.1
    smoketime 18 hours 22 minutes (average 2 hours 17 minutes)

Summary: FAIL(F)

O = OK  F = Failure(s), extended report at the bottom
X = Failure(s) under TEST but not under harness
? = still running or test results not (yet) available
Build failures during:       - = unknown or N/A
c = Configure, m = make, M = make (after miniperl), t = make test-prep

v5.28.0-RC2-2-g197e7984e9  Configuration (common) -Dcc=gcc
----------- ---------------------------------------------------------
F F F F F F 
F F F F F F -Duse64bitall
F F F F F F -Duseithreads
F F F F F F -Duseithreads -Duse64bitall
| | | | | +- LC_ALL = univ.utf8 -DDEBUGGING
| | | | +--- PERLIO = perlio -DDEBUGGING
| | | +----- PERLIO = stdio  -DDEBUGGING
| | +------- LC_ALL = univ.utf8
| +--------- PERLIO = perlio
+----------- PERLIO = stdio 

Locally applied patches:
    SMOKE197e7984e9f640254af80f8553707bad217f3814

Testsuite was run only with 'harness'

Failures: (common-args) -Dcc=gcc
[stdio/perlio/univ.utf8] 
[stdio/perlio/univ.utf8] -DDEBUGGING
[stdio/perlio/univ.utf8] -Duse64bitall
[stdio/perlio/univ.utf8] -DDEBUGGING -Duse64bitall
[stdio/perlio/univ.utf8] -Duseithreads
[stdio/perlio/univ.utf8] -Duseithreads -Duse64bitall
[univ.utf8] -DDEBUGGING -Duseithreads -Duse64bitall
../lib/warnings.t...........................................FAILED
    368

[stdio] -DDEBUGGING -Duseithreads
[perlio] -DDEBUGGING -Duseithreads -Duse64bitall
../t/io/nargv.t.............................................FAILED
    Bad plan.  You planned 6 tests but ran 5.
../lib/warnings.t...........................................FAILED
    368

[perlio] -DDEBUGGING -Duseithreads
../t/io/inplace.t...........................................FAILED
    Bad plan.  You planned 6 tests but ran 0.
../lib/warnings.t...........................................FAILED
    368

[univ.utf8] -DDEBUGGING -Duseithreads
../t/io/inplace.t...........................................FAILED
    Bad plan.  You planned 6 tests but ran 0.
../t/io/iprefix.t...........................................FAILED
    Bad plan.  You planned 2 tests but ran 0.
../lib/warnings.t...........................................FAILED
    368

[stdio] -DDEBUGGING -Duseithreads -Duse64bitall
../t/run/switches.t.........................................FAILED
    Non-zero exit status: 2
    Bad plan.  You planned 137 tests but ran 105.
../lib/warnings.t...........................................FAILED
    368

Passed Todo tests: (common-args) -Dcc=gcc
[stdio/perlio] 
[stdio/perlio] -DDEBUGGING
[stdio/perlio] -Duse64bitall
[stdio/perlio] -DDEBUGGING -Duse64bitall
[stdio/perlio] -Duseithreads
[stdio/perlio] -DDEBUGGING -Duseithreads
[stdio/perlio] -Duseithreads -Duse64bitall
[stdio/perlio] -DDEBUGGING -Duseithreads -Duse64bitall
../dist/Net-Ping/t/450_service.t............................PASSED
    9, 18

[univ.utf8] 
[univ.utf8] -DDEBUGGING
[univ.utf8] -Duse64bitall
[univ.utf8] -DDEBUGGING -Duse64bitall
[univ.utf8] -Duseithreads
[univ.utf8] -DDEBUGGING -Duseithreads
[univ.utf8] -Duseithreads -Duse64bitall
[univ.utf8] -DDEBUGGING -Duseithreads -Duse64bitall
../lib/B/Deparse.t..........................................PASSED
    2
../dist/Net-Ping/t/450_service.t............................PASSED
    9, 18

Compiler messages(gcc):
op.c: In function 'S_gen_constant_list':
op.c:5658:31: warning: argument 'o' might be clobbered by 'longjmp' or 'vfork' [-Wclobbered]
toke.c: In function 'Perl_scan_num':
toke.c:11143:54: warning: 'b' may be used uninitialized in this function [-Wuninitialized]
pp.c: In function 'Perl_pp_argelem':
pp.c:6780:13: warning: value computed is not used [-Wunused-value]
/usr/include/rpc/rpcb_prot.h:163:25: note: originally defined here
RealPPPort.xs: In function 'XS_Devel__PPPort_check_HeUTF8':
RealPPPort.xs:1817:17: warning: value computed is not used [-Wunused-value]
Socket.c: In function 'XS_Socket_pack_ip_mreq_source':
Socket.c:1654:7: warning: variable 'interface' set but not used [-Wunused-but-set-variable]
./const-xs.inc: In function 'boot_Socket':
./const-xs.inc:980:20: warning: missing braces around initializer [-Wmissing-braces]
./const-xs.inc:980:20: warning: (near initialization for 'ip6_address._s6_un') [-Wmissing-braces]
./const-xs.inc:989:20: warning: missing braces around initializer [-Wmissing-braces]
./const-xs.inc:989:20: warning: (near initialization for 'ip6_address._s6_un') [-Wmissing-braces]
const-c.inc: In function 'constant_19':
const-c.inc:351:42: warning: unused parameter 'iv_return' [-Wunused-parameter]
pp_sys.c: In function 'Perl_pp_gpwent':
pp_sys.c:5568:19: warning: implicit declaration of function 'getspnam_r' [-Wimplicit-function-declaration]

Non-Fatal messages(gcc):


Status overview available here: https://tux.nl/perl5/smoke/

-- 
Report by Test::Smoke v1.72_05 running on perl 5.14.2
(Reporter v0.054 / Smoker v0.046)

Thread Previous


nntp.perl.org: Perl Programming lists via nntp and http.
Comments to Ask Bjørn Hansen at ask@perl.org | Group listing | About