develooper Front page | perl.daily-build.reports | Postings from June 2018

Smoke [smoke-me/khw-encode] v5.28.0-RC1-16-gee50dc5205 FAIL(F)openbsd 6.3 (amd64/1 cpu)

From:
Carlos Guevara
Date:
June 3, 2018 10:00
Subject:
Smoke [smoke-me/khw-encode] v5.28.0-RC1-16-gee50dc5205 FAIL(F)openbsd 6.3 (amd64/1 cpu)
Message ID:
1b88ccb7b479bd07@cjg-openbsd6
Automated smoke report for branch smoke-me/khw-encode 5.28.0 patch ee50dc5205345073f6ea597553fb7c588bf910c6 v5.28.0-RC1-16-gee50dc5205
cjg-openbsd6: Intel(R) Xeon(R) CPU E5420 @ 2.50GHz (2500 MHz) (amd64/1 cpu)
    on        openbsd - 6.3
    using     cc version 4.2.1 Compatible OpenBSD Clang 5.0.1 (tags/RELEASE_501/final)
    smoketime 15 hours 20 minutes (average 1 hour 55 minutes)

Summary: FAIL(F)

O = OK  F = Failure(s), extended report at the bottom
X = Failure(s) under TEST but not under harness
? = still running or test results not (yet) available
Build failures during:       - = unknown or N/A
c = Configure, m = make, M = make (after miniperl), t = make test-prep

v5.28.0-RC1-16-gee50dc5205  Configuration (common) none
----------- ---------------------------------------------------------
F F         
F F         -Duse64bitall
F F         -Duseithreads
F F         -Duseithreads -Duse64bitall
| +--------- -DDEBUGGING
+----------- no debugging


Locally applied patches:
    SMOKEee50dc5205345073f6ea597553fb7c588bf910c6

Testsuite was run only with 'harness'

Tests skipped on user request:
    # One test name on a line
Failures: (common-args) none
[default] 
[default] -DDEBUGGING -Duse64bitall
[default] -DDEBUGGING -Duseithreads
[default] -Duseithreads -Duse64bitall
../t/op/time.t..............................................FAILED
    2
../t/porting/manifest.t.....................................FAILED
    10508, 10510-10511
../ext/PerlIO-encoding/t/fallback.t.........................FAILED
    2
    Non-zero exit status: 1

[default] -DDEBUGGING
[default] -Duse64bitall
[default] -Duseithreads
[default] -DDEBUGGING -Duseithreads -Duse64bitall
../t/porting/manifest.t.....................................FAILED
    10508, 10510-10511
../ext/PerlIO-encoding/t/fallback.t.........................FAILED
    2
    Non-zero exit status: 1

MANIFEST did not declare 'cpan/Encode/ppport.h'

Compiler messages(gcc):
/home/core/tmp/try-eb2621.o: In function `main':
Encode.c:1360:5: warning: unused variable 'ix' [-Wunused-variable]
../../XSUB.h:185:20: note: expanded from macro 'dXSI32'
Encode.c:1402:5: warning: unused variable 'ix' [-Wunused-variable]
./const-c.inc:351:42: warning: unused parameter 'iv_return' [-Wunused-parameter]
/home/core/tmp/try-d6f292.o: In function `main':
/home/core/smoke/perl-current/UU/try.c:51: warning: sprintf() is often misused, please use snprintf()
/home/core/tmp/try-dfedd3.o: In function `main':
/home/core/tmp/try-5aec3b.o: In function `main':
/home/core/tmp/try-65806e.o: In function `main':
/home/core/tmp/try-fdf7fb.o: In function `main':
/home/core/tmp/try-0e3f70.o: In function `main':
/home/core/tmp/try-c85396.o: In function `main':

Non-Fatal messages(gcc):



-- 
Report by Test::Smoke v1.71 running on perl 5.26.1
(Reporter v0.053 / Smoker v0.046)



nntp.perl.org: Perl Programming lists via nntp and http.
Comments to Ask Bjørn Hansen at ask@perl.org | Group listing | About