develooper Front page | perl.daily-build.reports | Postings from May 2018

Smoke [blead] v5.27.11-39-g3cacfe74ed FAIL(XF) dragonfly 5.2-RELEASE(x86_64/2 cpu)

From:
Tomasz Konojacki
Date:
May 17, 2018 03:10
Subject:
Smoke [blead] v5.27.11-39-g3cacfe74ed FAIL(XF) dragonfly 5.2-RELEASE(x86_64/2 cpu)
Message ID:
5afcf296.1133bc.6c243ef@boettgerilla-pallens.xenu.pl
Automated smoke report for branch blead 5.28.0 patch 3cacfe74edaec4b2b1289e9809e4e68a2bf5b851 v5.27.11-39-g3cacfe74ed
boettgerilla-pallens.xenu.pl: Intel(R) Xeon(R) CPU E3-1275 V2 @ 3.50GHz (x86_64/2 cpu)
    on        dragonfly - 5.2-RELEASE
    using     cc version 5.4.1 [DragonFly] Release/2016-08-27
    smoketime 5 hours 3 minutes (average 37 minutes 53 seconds)

Summary: FAIL(XF)

O = OK  F = Failure(s), extended report at the bottom
X = Failure(s) under TEST but not under harness
? = still running or test results not (yet) available
Build failures during:       - = unknown or N/A
c = Configure, m = make, M = make (after miniperl), t = make test-prep

v5.27.11-39-g3cacfe74ed  Configuration (common) none
----------- ---------------------------------------------------------
F O F O     
O O O O     -Duselongdouble
F X F O     -Duseithreads
F O F O     -Duseithreads -Duselongdouble
| | | +----- PERLIO = perlio -DDEBUGGING
| | +------- PERLIO = stdio  -DDEBUGGING
| +--------- PERLIO = perlio
+----------- PERLIO = stdio


Locally applied patches:
    SMOKE3cacfe74edaec4b2b1289e9809e4e68a2bf5b851

Tests skipped on user request:
    # One test name on a line
Failures: (common-args) none
[stdio] 
    ../cpan/Sys-Syslog/t/syslog.t...............................FAILED
        144-145
        Non-zero exit status: 2

[stdio] -DDEBUGGING
    ../cpan/Sys-Syslog/t/syslog.t...............................FAILED
        144-147
        Non-zero exit status: 4

[stdio] -Duseithreads
    ../ext/XS-APItest/t/handy00.t...............................FAILED
        No plan found in TAP output

[perlio] -Duseithreads
Inconsistent test results (between TEST and harness):
    ../cpan/Sys-Syslog/t/syslog.t........... ....................................... FAILED at test 190

[stdio] -DDEBUGGING -Duseithreads
    ../ext/XS-APItest/t/handy00.t...............................FAILED
        No plan found in TAP output
Inconsistent test results (between TEST and harness):
    ../cpan/Sys-Syslog/t/syslog.t........... ....................................... FAILED at test 144

[stdio] -Duseithreads -Duselongdouble
[stdio] -DDEBUGGING -Duseithreads -Duselongdouble
    ../ext/XS-APItest/t/handy00.t...............................FAILED
        No plan found in TAP output
Inconsistent test results (between TEST and harness):
    ../cpan/Sys-Syslog/t/syslog.t........... ....................................... FAILED at test 146

Compiler messages(dragonfly):


Non-Fatal messages(dragonfly):



-- 
Report by Test::Smoke v1.71 running on perl 5.26.1
(Reporter v0.053 / Smoker v0.046)



nntp.perl.org: Perl Programming lists via nntp and http.
Comments to Ask Bjørn Hansen at ask@perl.org | Group listing | About