develooper Front page | perl.daily-build.reports | Postings from May 2018

Smoke [blead] v5.27.11-38-g64a9c78095 FAIL(XF) dragonfly 5.2-RELEASE(x86_64/2 cpu)

From:
Tomasz Konojacki
Date:
May 11, 2018 15:09
Subject:
Smoke [blead] v5.27.11-38-g64a9c78095 FAIL(XF) dragonfly 5.2-RELEASE(x86_64/2 cpu)
Message ID:
5af5b228.1133bb.171ad4d5@boettgerilla-pallens.xenu.pl
Automated smoke report for branch blead 5.28.0 patch 64a9c780950becebc7326a31d067801ec9b187a2 v5.27.11-38-g64a9c78095
boettgerilla-pallens.xenu.pl: Intel(R) Xeon(R) CPU E3-1275 V2 @ 3.50GHz (x86_64/2 cpu)
    on        dragonfly - 5.2-RELEASE
    using     cc version 5.4.1 [DragonFly] Release/2016-08-27
    smoketime 5 hours 2 minutes (average 37 minutes 47 seconds)

Summary: FAIL(XF)

O = OK  F = Failure(s), extended report at the bottom
X = Failure(s) under TEST but not under harness
? = still running or test results not (yet) available
Build failures during:       - = unknown or N/A
c = Configure, m = make, M = make (after miniperl), t = make test-prep

v5.27.11-38-g64a9c78095  Configuration (common) none
----------- ---------------------------------------------------------
O O O O     
O O O O     -Duselongdouble
F O F X     -Duseithreads
F X F O     -Duseithreads -Duselongdouble
| | | +----- PERLIO = perlio -DDEBUGGING
| | +------- PERLIO = stdio  -DDEBUGGING
| +--------- PERLIO = perlio
+----------- PERLIO = stdio


Locally applied patches:
    SMOKE64a9c780950becebc7326a31d067801ec9b187a2

Tests skipped on user request:
    # One test name on a line
Failures: (common-args) none
[stdio] -Duseithreads
    ../ext/XS-APItest/t/handy00.t...............................FAILED
        No plan found in TAP output
Inconsistent test results (between TEST and harness):
    ../cpan/Sys-Syslog/t/syslog.t........... ....................................... FAILED at test 144

[stdio] -DDEBUGGING -Duseithreads
[stdio] -Duseithreads -Duselongdouble
[stdio] -DDEBUGGING -Duseithreads -Duselongdouble
    ../ext/XS-APItest/t/handy00.t...............................FAILED
        No plan found in TAP output

[perlio] -DDEBUGGING -Duseithreads
Inconsistent test results (between TEST and harness):
    ../cpan/Sys-Syslog/t/syslog.t........... ....................................... FAILED at test 144

[perlio] -Duseithreads -Duselongdouble
Inconsistent test results (between TEST and harness):
    ../cpan/Sys-Syslog/t/syslog.t........... ....................................... FAILED at test 146

Compiler messages(dragonfly):


Non-Fatal messages(dragonfly):



-- 
Report by Test::Smoke v1.71 running on perl 5.26.1
(Reporter v0.053 / Smoker v0.046)



nntp.perl.org: Perl Programming lists via nntp and http.
Comments to Ask Bjørn Hansen at ask@perl.org | Group listing | About