develooper Front page | perl.daily-build.reports | Postings from April 2018

Smoke [5.27.11] v5.27.10-185-g4273b0ccca FAIL(F) openvms V8.4-2L1(IA64/2 cpu)

From:
Craig A. Berry
Date:
April 20, 2018 01:50
Subject:
Smoke [5.27.11] v5.27.10-185-g4273b0ccca FAIL(F) openvms V8.4-2L1(IA64/2 cpu)
Message ID:
466214.163784997-sendEmail@alma
Automated smoke report for 5.27.11 patch 4273b0cccad37ddd85afb1abe763af2c6a6023a5 v5.27.10-185-g4273b0ccca
ALMA: HP rx2660  (1.67GHz/9.0MB) (IA64/2 cpu)
    on        openvms - V8.4-2L1
    using     VSI C V7.4-001

    smoketime 2 hours 53 minutes (average 1 hour 26 minutes)

Summary: FAIL(F)

O = OK  F = Failure(s), extended report at the bottom
X = Failure(s) under TEST but not under harness
? = still running or test results not (yet) available
Build failures during:       - = unknown or N/A
c = Configure, m = make, M = make (after miniperl), t = make test-prep

v5.27.10-185-g4273b0ccca  Configuration (common) none
----------- ---------------------------------------------------------
F -         
F -         -Duseithreads
| +--------- -DDEBUGGING
+----------- no debugging


Locally applied patches:
    SMOKE4273b0cccad37ddd85afb1abe763af2c6a6023a5

Failures: (common-args) none
[default] 
    t/re/regexp_nonull ............................................. FAILED--unexpected output at test 0
    t/op/goto_xs ................................................... FAILED--unexpected output at test 0
    t/op/sub ....................................................... FAILED--unexpected output at test 27
    ext/XS-APItest/t/addissub ...................................... FAILED--expected 9 tests, saw 0
    ext/XS-APItest/t/arrayexpr ..................................... FAILED at test 1
    ext/XS-APItest/t/autoload ...................................... FAILED--expected 26 tests, saw 0
    ext/XS-APItest/t/blockasexpr ................................... FAILED at test 1
    ext/XS-APItest/t/blockhooks .................................... FAILED--expected 17 tests, saw 0
    ext/XS-APItest/t/blockhooks-csc ................................ FAILED--expected 12 tests, saw 0
    ext/XS-APItest/t/bootstrap ..................................... FAILED--no leader found
    ext/XS-APItest/t/call .......................................... FAILED at test 1
    ext/XS-APItest/t/call_checker .................................. FAILED--expected 78 tests, saw 0
    ext/XS-APItest/t/caller ........................................ FAILED--no leader found
    ext/XS-APItest/t/callregexec ................................... FAILED--no leader found
    ext/XS-APItest/t/cleanup ....................................... FAILED--expected 3 tests, saw 0
    ext/XS-APItest/t/clone-with-stack .............................. FAILED--no leader found
    ext/XS-APItest/t/cophh ......................................... FAILED--expected 2 tests, saw 0
    ext/XS-APItest/t/coplabel ...................................... FAILED--expected 1 tests, saw 0
    ext/XS-APItest/t/copyhints ..................................... FAILED--expected 1 tests, saw 0
    ext/XS-APItest/t/customop ...................................... FAILED--expected 25 tests, saw 0
    ext/XS-APItest/t/cv_name ....................................... FAILED--no leader found
    ext/XS-APItest/t/eval-filter ................................... FAILED--expected 5 tests, saw 0
    ext/XS-APItest/t/exception ..................................... FAILED at test 1
    ext/XS-APItest/t/extend ........................................ FAILED--no leader found
    ext/XS-APItest/t/fetch_pad_names ............................... FAILED--no leader found
    ext/XS-APItest/t/get ........................................... FAILED--expected 5 tests, saw 0
    ext/XS-APItest/t/gotosub ....................................... FAILED--expected 1 tests, saw 0
    ext/XS-APItest/t/grok .......................................... FAILED--no leader found
    ext/XS-APItest/t/gv_autoload4 .................................. FAILED at test 1
    ext/XS-APItest/t/gv_const_sv ................................... FAILED--expected 6 tests, saw 0
    ext/XS-APItest/t/gv_fetchmeth .................................. FAILED at test 1
    ext/XS-APItest/t/gv_fetchmeth_autoload ......................... FAILED at test 1
    ext/XS-APItest/t/gv_fetchmethod_flags .......................... FAILED at test 1
    ext/XS-APItest/t/gv_init ....................................... FAILED--expected 12 tests, saw 0
    ext/XS-APItest/t/handy00 ....................................... FAILED--no leader found
    ext/XS-APItest/t/handy01 ....................................... FAILED--no leader found
    ext/XS-APItest/t/handy02 ....................................... FAILED--no leader found
    ext/XS-APItest/t/handy03 ....................................... FAILED--no leader found
    ext/XS-APItest/t/handy04 ....................................... FAILED--no leader found
    ext/XS-APItest/t/handy05 ....................................... FAILED--no leader found
    ext/XS-APItest/t/handy06 ....................................... FAILED--no leader found
    ext/XS-APItest/t/handy07 ....................................... FAILED--no leader found
    ext/XS-APItest/t/handy08 ....................................... FAILED--no leader found
    ext/XS-APItest/t/handy09 ....................................... FAILED--no leader found
    ext/XS-APItest/t/hash .......................................... FAILED at test 1
    ext/XS-APItest/t/join_with_space ............................... FAILED--expected 1 tests, saw 0
    ext/XS-APItest/t/keyword_multiline ............................. FAILED--expected 4 tests, saw 0
    ext/XS-APItest/t/keyword_plugin ................................ FAILED at test 2
    ext/XS-APItest/t/labelconst .................................... FAILED at test 1
    ext/XS-APItest/t/lexsub ........................................ FAILED--expected 5 tests, saw 0
    ext/XS-APItest/t/load-module ................................... FAILED--no leader found
    ext/XS-APItest/t/locale ........................................ FAILED--no leader found
    ext/XS-APItest/t/loopblock ..................................... FAILED at test 1
    ext/XS-APItest/t/looprest ...................................... FAILED at test 1
    ext/XS-APItest/t/lvalue ........................................ FAILED--expected 4 tests, saw 0
    ext/XS-APItest/t/magic ......................................... FAILED--no leader found
    ext/XS-APItest/t/magic_chain ................................... FAILED--expected 1 tests, saw 0
    ext/XS-APItest/t/mro ........................................... FAILED--no leader found
    ext/XS-APItest/t/multicall ..................................... FAILED--expected 80 tests, saw 0
    ext/XS-APItest/t/my_cxt ........................................ FAILED at test 1
    ext/XS-APItest/t/my_exit ....................................... FAILED--no leader found
    ext/XS-APItest/t/newCONSTSUB ................................... FAILED--expected 22 tests, saw 0
    ext/XS-APItest/t/newDEFSVOP .................................... FAILED--expected 7 tests, saw 0
    ext/XS-APItest/t/op ............................................ FAILED at test 1
    ext/XS-APItest/t/op_contextualize .............................. FAILED--expected 1 tests, saw 0
    ext/XS-APItest/t/op_list ....................................... FAILED--expected 2 tests, saw 0
    ext/XS-APItest/t/overload ...................................... FAILED at test 1
    ext/XS-APItest/t/pad_scalar .................................... FAILED--expected 76 tests, saw 0
    ext/XS-APItest/t/peep .......................................... FAILED--expected 6 tests, saw 0
    ext/XS-APItest/t/pmflag ........................................ FAILED at test 2
    ext/XS-APItest/t/postinc ....................................... FAILED at test 1
    ext/XS-APItest/t/printf ........................................ FAILED at test 1
    ext/XS-APItest/t/ptr_table ..................................... FAILED--no leader found
    ext/XS-APItest/t/push .......................................... FAILED at test 1
    ext/XS-APItest/t/refs .......................................... FAILED at test 1
    ext/XS-APItest/t/rmagical ...................................... FAILED at test 1
    ext/XS-APItest/t/rv2cv_op_cv ................................... FAILED--expected 1 tests, saw 0
    ext/XS-APItest/t/savehints ..................................... FAILED--expected 1 tests, saw 0
    ext/XS-APItest/t/scopelessblock ................................ FAILED at test 1
    ext/XS-APItest/t/sort .......................................... FAILED--expected 2 tests, saw 0
    ext/XS-APItest/t/stmtasexpr .................................... FAILED at test 1
    ext/XS-APItest/t/stmtsasexpr ................................... FAILED at test 1
    ext/XS-APItest/t/stuff_modify_bug .............................. FAILED--expected 1 tests, saw 0
    ext/XS-APItest/t/stuff_svcur_bug ............................... FAILED--expected 1 tests, saw 0
    ext/XS-APItest/t/subcall ....................................... FAILED--expected 1 tests, saw 0
    ext/XS-APItest/t/svcat ......................................... FAILED--expected 4 tests, saw 0
    ext/XS-APItest/t/svcatpvf ...................................... FAILED--expected 4 tests, saw 0
    ext/XS-APItest/t/sviscow ....................................... FAILED--expected 1 tests, saw 0
    ext/XS-APItest/t/svpeek ........................................ FAILED at test 1
    ext/XS-APItest/t/svpv .......................................... FAILED--expected 19 tests, saw 0
    ext/XS-APItest/t/svpv_magic .................................... FAILED at test 1
    ext/XS-APItest/t/svsetsv ....................................... FAILED at test 1
    ext/XS-APItest/t/swaplabel ..................................... FAILED at test 1
    ext/XS-APItest/t/swaptwostmts .................................. FAILED at test 2
    ext/XS-APItest/t/sym-hook ...................................... FAILED--no leader found
    ext/XS-APItest/t/synthetic_scope ............................... FAILED--expected 18 tests, saw 0
    ext/XS-APItest/t/temp_lv_sub ................................... FAILED at test 1
    ext/XS-APItest/t/underscore_length ............................. FAILED--expected 2 tests, saw 0
    ext/XS-APItest/t/utf16_to_utf8 ................................. FAILED--no leader found
    ext/XS-APItest/t/utf8 .......................................... FAILED at test 1
    ext/XS-APItest/t/utf8_to_bytes ................................. FAILED at test 1
    ext/XS-APItest/t/utf8_warn00 ................................... FAILED at test 1
    ext/XS-APItest/t/utf8_warn01 ................................... FAILED at test 1
    ext/XS-APItest/t/utf8_warn02 ................................... FAILED at test 1
    ext/XS-APItest/t/utf8_warn03 ................................... FAILED at test 1
    ext/XS-APItest/t/utf8_warn04 ................................... FAILED at test 1
    ext/XS-APItest/t/utf8_warn05 ................................... FAILED at test 1
    ext/XS-APItest/t/utf8_warn06 ................................... FAILED at test 1
    ext/XS-APItest/t/utf8_warn07 ................................... FAILED at test 1
    ext/XS-APItest/t/utf8_warn08 ................................... FAILED at test 1
    ext/XS-APItest/t/utf8_warn09 ................................... FAILED at test 1
    ext/XS-APItest/t/weaken ........................................ FAILED at test 1
    ext/XS-APItest/t/whichsig ...................................... FAILED at test 1
    ext/XS-APItest/t/win32 ......................................... FAILED--no leader found
    ext/XS-APItest/t/xs_special_subs ............................... FAILED at test 11
    ext/XS-APItest/t/xs_special_subs_require ....................... FAILED at test 71
    ext/XS-APItest/t/xsub_h ........................................ FAILED at test 1
    cpan/Test-Harness/t/proverun ................................... FAILED at test 3

[default] -Duseithreads
    t/re/regexp_nonull ............................................. FAILED--unexpected output at test 0
    t/op/chdir ..................................................... FAILED at test 28
    t/op/goto_xs ................................................... FAILED--unexpected output at test 0
    t/op/sub ....................................................... FAILED--unexpected output at test 27
    ext/XS-APItest/t/addissub ...................................... FAILED--expected 9 tests, saw 0
    ext/XS-APItest/t/arrayexpr ..................................... FAILED at test 1
    ext/XS-APItest/t/autoload ...................................... FAILED--expected 26 tests, saw 0
    ext/XS-APItest/t/blockasexpr ................................... FAILED at test 1
    ext/XS-APItest/t/blockhooks .................................... FAILED--expected 17 tests, saw 0
    ext/XS-APItest/t/blockhooks-csc ................................ FAILED--expected 12 tests, saw 0
    ext/XS-APItest/t/bootstrap ..................................... FAILED--no leader found
    ext/XS-APItest/t/call .......................................... FAILED at test 1
    ext/XS-APItest/t/call_checker .................................. FAILED--expected 78 tests, saw 0
    ext/XS-APItest/t/caller ........................................ FAILED--no leader found
    ext/XS-APItest/t/callregexec ................................... FAILED--no leader found
    ext/XS-APItest/t/cleanup ....................................... FAILED--expected 3 tests, saw 0
    ext/XS-APItest/t/clone-with-stack .............................. FAILED--no leader found
    ext/XS-APItest/t/cophh ......................................... FAILED--expected 2 tests, saw 0
    ext/XS-APItest/t/coplabel ...................................... FAILED--expected 1 tests, saw 0
    ext/XS-APItest/t/copstash ...................................... FAILED--no leader found
    ext/XS-APItest/t/copyhints ..................................... FAILED--expected 1 tests, saw 0
    ext/XS-APItest/t/customop ...................................... FAILED--expected 25 tests, saw 0
    ext/XS-APItest/t/cv_name ....................................... FAILED--no leader found
    ext/XS-APItest/t/eval-filter ................................... FAILED--expected 5 tests, saw 0
    ext/XS-APItest/t/exception ..................................... FAILED at test 1
    ext/XS-APItest/t/extend ........................................ FAILED--no leader found
    ext/XS-APItest/t/fetch_pad_names ............................... FAILED--no leader found
    ext/XS-APItest/t/get ........................................... FAILED--expected 5 tests, saw 0
    ext/XS-APItest/t/gotosub ....................................... FAILED--expected 1 tests, saw 0
    ext/XS-APItest/t/grok .......................................... FAILED--no leader found
    ext/XS-APItest/t/gv_autoload4 .................................. FAILED at test 1
    ext/XS-APItest/t/gv_const_sv ................................... FAILED--expected 6 tests, saw 0
    ext/XS-APItest/t/gv_fetchmeth .................................. FAILED at test 1
    ext/XS-APItest/t/gv_fetchmeth_autoload ......................... FAILED at test 1
    ext/XS-APItest/t/gv_fetchmethod_flags .......................... FAILED at test 1
    ext/XS-APItest/t/gv_init ....................................... FAILED--expected 12 tests, saw 0
    ext/XS-APItest/t/handy00 ....................................... FAILED--no leader found
    ext/XS-APItest/t/handy01 ....................................... FAILED--no leader found
    ext/XS-APItest/t/handy02 ....................................... FAILED--no leader found
    ext/XS-APItest/t/handy03 ....................................... FAILED--no leader found
    ext/XS-APItest/t/handy04 ....................................... FAILED--no leader found
    ext/XS-APItest/t/handy05 ....................................... FAILED--no leader found
    ext/XS-APItest/t/handy06 ....................................... FAILED--no leader found
    ext/XS-APItest/t/handy07 ....................................... FAILED--no leader found
    ext/XS-APItest/t/handy08 ....................................... FAILED--no leader found
    ext/XS-APItest/t/handy09 ....................................... FAILED--no leader found
    ext/XS-APItest/t/hash .......................................... FAILED at test 1
    ext/XS-APItest/t/join_with_space ............................... FAILED--expected 1 tests, saw 0
    ext/XS-APItest/t/keyword_multiline ............................. FAILED--expected 4 tests, saw 0
    ext/XS-APItest/t/keyword_plugin ................................ FAILED at test 2
    ext/XS-APItest/t/keyword_plugin_threads ........................ FAILED at test 1
    ext/XS-APItest/t/labelconst .................................... FAILED at test 1
    ext/XS-APItest/t/lexsub ........................................ FAILED--expected 5 tests, saw 0
    ext/XS-APItest/t/load-module ................................... FAILED--no leader found
    ext/XS-APItest/t/locale ........................................ FAILED--no leader found
    ext/XS-APItest/t/loopblock ..................................... FAILED at test 1
    ext/XS-APItest/t/looprest ...................................... FAILED at test 1
    ext/XS-APItest/t/lvalue ........................................ FAILED--expected 4 tests, saw 0
    ext/XS-APItest/t/magic ......................................... FAILED--no leader found
    ext/XS-APItest/t/magic_chain ................................... FAILED--expected 1 tests, saw 0
    ext/XS-APItest/t/mro ........................................... FAILED--no leader found
    ext/XS-APItest/t/multicall ..................................... FAILED--expected 80 tests, saw 0
    ext/XS-APItest/t/my_cxt ........................................ FAILED at test 1
    ext/XS-APItest/t/my_exit ....................................... FAILED--no leader found
    ext/XS-APItest/t/newCONSTSUB ................................... FAILED--expected 22 tests, saw 0
    ext/XS-APItest/t/newDEFSVOP .................................... FAILED--expected 7 tests, saw 0
    ext/XS-APItest/t/op ............................................ FAILED at test 1
    ext/XS-APItest/t/op_contextualize .............................. FAILED--expected 1 tests, saw 0
    ext/XS-APItest/t/op_list ....................................... FAILED--expected 2 tests, saw 0
    ext/XS-APItest/t/overload ...................................... FAILED at test 1
    ext/XS-APItest/t/pad_scalar .................................... FAILED--expected 76 tests, saw 0
    ext/XS-APItest/t/peep .......................................... FAILED--expected 6 tests, saw 0
    ext/XS-APItest/t/pmflag ........................................ FAILED at test 2
    ext/XS-APItest/t/postinc ....................................... FAILED at test 1
    ext/XS-APItest/t/printf ........................................ FAILED at test 1
    ext/XS-APItest/t/ptr_table ..................................... FAILED--no leader found
    ext/XS-APItest/t/push .......................................... FAILED at test 1
    ext/XS-APItest/t/refs .......................................... FAILED at test 1
    ext/XS-APItest/t/rmagical ...................................... FAILED at test 1
    ext/XS-APItest/t/rv2cv_op_cv ................................... FAILED--expected 1 tests, saw 0
    ext/XS-APItest/t/savehints ..................................... FAILED--expected 1 tests, saw 0
    ext/XS-APItest/t/scopelessblock ................................ FAILED at test 1
    ext/XS-APItest/t/sort .......................................... FAILED--expected 2 tests, saw 0
    ext/XS-APItest/t/stmtasexpr .................................... FAILED at test 1
    ext/XS-APItest/t/stmtsasexpr ................................... FAILED at test 1
    ext/XS-APItest/t/stuff_modify_bug .............................. FAILED--expected 1 tests, saw 0
    ext/XS-APItest/t/stuff_svcur_bug ............................... FAILED--expected 1 tests, saw 0
    ext/XS-APItest/t/subcall ....................................... FAILED--expected 1 tests, saw 0
    ext/XS-APItest/t/svcat ......................................... FAILED--expected 4 tests, saw 0
    ext/XS-APItest/t/svcatpvf ...................................... FAILED--expected 4 tests, saw 0
    ext/XS-APItest/t/sviscow ....................................... FAILED--expected 1 tests, saw 0
    ext/XS-APItest/t/svpeek ........................................ FAILED at test 1
    ext/XS-APItest/t/svpv .......................................... FAILED--expected 19 tests, saw 0
    ext/XS-APItest/t/svpv_magic .................................... FAILED at test 1
    ext/XS-APItest/t/svsetsv ....................................... FAILED at test 1
    ext/XS-APItest/t/swaplabel ..................................... FAILED at test 1
    ext/XS-APItest/t/swaptwostmts .................................. FAILED at test 2
    ext/XS-APItest/t/sym-hook ...................................... FAILED--no leader found
    ext/XS-APItest/t/synthetic_scope ............................... FAILED--expected 18 tests, saw 0
    ext/XS-APItest/t/temp_lv_sub ................................... FAILED at test 1
    ext/XS-APItest/t/underscore_length ............................. FAILED--expected 2 tests, saw 0
    ext/XS-APItest/t/utf16_to_utf8 ................................. FAILED--no leader found
    ext/XS-APItest/t/utf8 .......................................... FAILED at test 1
    ext/XS-APItest/t/utf8_to_bytes ................................. FAILED at test 1
    ext/XS-APItest/t/utf8_warn00 ................................... FAILED at test 1
    ext/XS-APItest/t/utf8_warn01 ................................... FAILED at test 1
    ext/XS-APItest/t/utf8_warn02 ................................... FAILED at test 1
    ext/XS-APItest/t/utf8_warn03 ................................... FAILED at test 1
    ext/XS-APItest/t/utf8_warn04 ................................... FAILED at test 1
    ext/XS-APItest/t/utf8_warn05 ................................... FAILED at test 1
    ext/XS-APItest/t/utf8_warn06 ................................... FAILED at test 1
    ext/XS-APItest/t/utf8_warn07 ................................... FAILED at test 1
    ext/XS-APItest/t/utf8_warn08 ................................... FAILED at test 1
    ext/XS-APItest/t/utf8_warn09 ................................... FAILED at test 1
    ext/XS-APItest/t/weaken ........................................ FAILED at test 1
    ext/XS-APItest/t/whichsig ...................................... FAILED at test 1
    ext/XS-APItest/t/win32 ......................................... FAILED--no leader found
    ext/XS-APItest/t/xs_special_subs ............................... FAILED at test 11
    ext/XS-APItest/t/xs_special_subs_require ....................... FAILED at test 71
    ext/XS-APItest/t/xsub_h ........................................ FAILED at test 1
    cpan/Test-Harness/t/proverun ................................... FAILED at test 3

MANIFEST did not declare 'CPAN/LOCALE-CODES/T/ERRORS^.1.T'
MANIFEST did not declare 'CPAN/LOCALE-CODES/T/ERRORS^.2.T'
MANIFEST declared 'CPAN/LOCALE-CODES/T/ERRORS_1.T' but it is missing
MANIFEST declared 'CPAN/LOCALE-CODES/T/ERRORS_2.T' but it is missing
MANIFEST did not declare 'CPAN/PARENT/T/RT62341^.T.DISABLED'
MANIFEST declared 'CPAN/PARENT/T/RT62341_T.DISABLED' but it is missing
MANIFEST did not declare 'CPAN/^.DIR-LOCALS.EL'
MANIFEST declared 'CPAN/_DIR-LOCALS.EL' but it is missing
MANIFEST did not declare 'CROSS/MAKEFILE^.SH.PATCH'
MANIFEST declared 'CROSS/MAKEFILE_SH.PATCH' but it is missing
MANIFEST did not declare 'DIST/STORABLE/STORABLE^.PM.PL'
MANIFEST declared 'DIST/STORABLE/STORABLE_PM.PL' but it is missing
MANIFEST did not declare '^.DIR-LOCALS.EL'
MANIFEST did not declare '^.METACONF-EXCLUSIONS.TXT'
MANIFEST did not declare '^.TRAVIS.YML'
MANIFEST declared '_DIR-LOCALS.EL' but it is missing
MANIFEST declared '_METACONF-EXCLUSIONS.TXT' but it is missing
MANIFEST declared '_TRAVIS.YML' but it is missing

Compiler messages(VMS):

	    neg = PL_statcache.st_ino < 0;
.................^
%CC-I-QUESTCOMPARE, In this statement, the unsigned expression "(my_perl->Istatcache).st_ino" is being compared with a relational operator to a constant whose value is not greater than zero.  This might not be what you intended.
at line number 2997 in file SMOKE_BUILD_ROOT:[blead]pp_sys.c;1

        return len - (STRLEN)(s->posn) <= 0;
..............^
%CC-I-QUESTCOMPARE, In this statement, the unsigned expression "len-(STRLEN)(s->posn)" is being compared with a relational operator to a constant whose value is not greater than zero.  This might not be what you intended.
at line number 25 in file SMOKE_BUILD_ROOT:[blead.ext.PerlIO-scalar]scalar.xs;1
%ILINK-W-NUDFSYMS, 4 undefined symbols:
%ILINK-I-UDFSYM, 	PERL_TO_UTF8_FOLD
%ILINK-I-UDFSYM, 	PERL_TO_UTF8_LOWER
%ILINK-I-UDFSYM, 	PERL_TO_UTF8_TITLE
%ILINK-I-UDFSYM, 	PERL_TO_UTF8_UPPER
%ILINK-W-USEUNDEF, undefined symbol PERL_TO_UTF8_LOWER referenced
	section: $CODE$
	offset: %X00000000000DD330  slot: 2
	module: APITEST 
	file: SMOKE_BUILD_ROOT:[blead.lib.auto.XS.APItest]APITEST.OLB;1
%ILINK-W-USEUNDEF, undefined symbol PERL_TO_UTF8_FOLD referenced
	section: $CODE$
	offset: %X00000000000DFD40  slot: 2
	module: APITEST 
	file: SMOKE_BUILD_ROOT:[blead.lib.auto.XS.APItest]APITEST.OLB;1
%ILINK-W-USEUNDEF, undefined symbol PERL_TO_UTF8_UPPER referenced
	section: $CODE$
	offset: %X00000000000E2750  slot: 2
	module: APITEST 
	file: SMOKE_BUILD_ROOT:[blead.lib.auto.XS.APItest]APITEST.OLB;1
%ILINK-W-USEUNDEF, undefined symbol PERL_TO_UTF8_TITLE referenced
	section: $CODE$
	offset: %X00000000000E48E0  slot: 2
	module: APITEST 
	file: SMOKE_BUILD_ROOT:[blead.lib.auto.XS.APItest]APITEST.OLB;1

-- 
Report by Test::Smoke v1.53 build 1374 running on perl 5.24.2
(Reporter v0.050 / Smoker v0.045)




nntp.perl.org: Perl Programming lists via nntp and http.
Comments to Ask Bjørn Hansen at ask@perl.org | Group listing | About