develooper Front page | perl.daily-build.reports | Postings from April 2018

Smoke [maint-5.26] v5.26.2-2-gec1caca18c FAIL(F) netbsd 7.1.2(amd64/1 cpu)

From:
Carlos Guevara
Date:
April 15, 2018 13:22
Subject:
Smoke [maint-5.26] v5.26.2-2-gec1caca18c FAIL(F) netbsd 7.1.2(amd64/1 cpu)
Message ID:
20180415132221.D7F7116C155@cjg-netbsd7
Automated smoke report for branch maint-5.26 5.26.2 patch ec1caca18cd82b52415e8d49701f71e4035de2cc v5.26.2-2-gec1caca18c
cjg-netbsd7: Intel 686-class (amd64/1 cpu)
    on        netbsd - 7.1.2
    using     cc version 4.8.5
    smoketime 6 hours 10 minutes (average 46 minutes 16 seconds)

Summary: FAIL(F)

O = OK  F = Failure(s), extended report at the bottom
X = Failure(s) under TEST but not under harness
? = still running or test results not (yet) available
Build failures during:       - = unknown or N/A
c = Configure, m = make, M = make (after miniperl), t = make test-prep

v5.26.2-2-gec1caca18c  Configuration (common) none
----------- ---------------------------------------------------------
F F         
F F         -Duse64bitall
F F         -Duseithreads
F F         -Duseithreads -Duse64bitall
| +--------- -DDEBUGGING
+----------- no debugging


Locally applied patches:
    SMOKEec1caca18cd82b52415e8d49701f71e4035de2cc

Testsuite was run only with 'harness'

Tests skipped on user request:
    # One test name on a line
Failures: (common-args) none
[default] 
[default] -DDEBUGGING
[default] -Duse64bitall
[default] -DDEBUGGING -Duse64bitall
[default] -Duseithreads
[default] -DDEBUGGING -Duseithreads
[default] -Duseithreads -Duse64bitall
[default] -DDEBUGGING -Duseithreads -Duse64bitall
../lib/locale.t.............................................FAILED
    431

Compiler messages(gcc):
toke.c: In function 'Perl_yylex':
toke.c:3037:24: warning: 'offset_to_max' may be used uninitialized in this function [-Wmaybe-uninitialized]
toke.c:2901:12: note: 'offset_to_max' was declared here
av.c: In function 'Perl_av_undef':
av.c:575:23: warning: 'orig_ix' may be used uninitialized in this function [-Wmaybe-uninitialized]
/usr/include/sys/cdefs_elf.h:67:20: error: missing binary operator before token "("
/usr/include/sys/cdefs_elf.h:73:20: error: missing binary operator before token "("
/usr/include/sys/cdefs_elf.h:79:20: error: missing binary operator before token "("
Zlib.c: In function 'XS_Compress__Raw__Zlib_constant':
../../embed.h:675:42: warning: 'iv' may be used uninitialized in this function [-Wmaybe-uninitialized]
./constants.xs:11:6: note: 'iv' was declared here
DB_File.c: In function 'XS_DB_File_constant':
SysV.c: In function 'XS_IPC__SysV__constant':
./const-xs.inc:11:6: note: 'iv' was declared here
Socket.c: In function 'XS_Socket_pack_ip_mreq_source':
Socket.c:1556:7: warning: variable 'interface' set but not used [-Wunused-but-set-variable]
HiRes.c: In function 'XS_Time__HiRes_constant':
Piece.xs: In function '_strptime':
Piece.xs:818:8: warning: 'len' may be used uninitialized in this function [-Wmaybe-uninitialized]
ExtTest.c: In function 'XS_ExtTest_constant':
../../../../embed.h:691:40: warning: 'pv' may be used uninitialized in this function [-Wmaybe-uninitialized]
ExtTest.xs:420:14: note: 'pv' was declared here
../../../../embed.h:691:40: warning: 'iv' may be used uninitialized in this function [-Wmaybe-uninitialized]
ExtTest.xs:418:6: note: 'iv' was declared here
ExtTest.xs:194:14: note: 'pv' was declared here
../../../../embed.h:675:42: warning: 'iv' may be used uninitialized in this function [-Wmaybe-uninitialized]
ExtTest.xs:209:6: note: 'iv' was declared here
ExtTest.xs:190:6: note: 'iv' was declared here
ExtTest.xs:166:6: note: 'iv' was declared here

Non-Fatal messages(gcc):



-- 
Report by Test::Smoke v1.71 running on perl 5.26.1
(Reporter v0.053 / Smoker v0.046)



nntp.perl.org: Perl Programming lists via nntp and http.
Comments to Ask Bjørn Hansen at ask@perl.org | Group listing | About