develooper Front page | perl.daily-build.reports | Postings from April 2018

Smoke [blead] v5.27.10-117-g908f2cb565 FAIL(F) openbsd 6.3 (amd64/1cpu)

From:
Carlos Guevara
Date:
April 10, 2018 11:48
Subject:
Smoke [blead] v5.27.10-117-g908f2cb565 FAIL(F) openbsd 6.3 (amd64/1cpu)
Message ID:
1d27470da5364e52@cjg-openbsd6
Automated smoke report for branch blead 5.27.11 patch 908f2cb56527d29c9176e478fa7eee0d02a7c77e v5.27.10-117-g908f2cb565
cjg-openbsd6: Intel(R) Xeon(R) CPU E5420 @ 2.50GHz (2510 MHz) (amd64/1 cpu)
    on        openbsd - 6.3
    using     cc version 4.2.1 Compatible OpenBSD Clang 5.0.1 (tags/RELEASE_501/final)
    smoketime 16 hours 21 minutes (average 2 hours 2 minutes)

Summary: FAIL(F)

O = OK  F = Failure(s), extended report at the bottom
X = Failure(s) under TEST but not under harness
? = still running or test results not (yet) available
Build failures during:       - = unknown or N/A
c = Configure, m = make, M = make (after miniperl), t = make test-prep

v5.27.10-117-g908f2cb565  Configuration (common) none
----------- ---------------------------------------------------------
F F         
F F         -Duse64bitall
O O         -Duseithreads
O O         -Duseithreads -Duse64bitall
| +--------- -DDEBUGGING
+----------- no debugging


Locally applied patches:
    SMOKE908f2cb56527d29c9176e478fa7eee0d02a7c77e

Testsuite was run only with 'harness'

Tests skipped on user request:
    # One test name on a line
Failures: (common-args) none
[default] 
../t/run/locale.t...........................................FAILED
    38-39
../t/op/time.t..............................................FAILED
    2

[default] -DDEBUGGING
[default] -Duse64bitall
[default] -DDEBUGGING -Duse64bitall
../t/run/locale.t...........................................FAILED
    38-39

Passed Todo tests: (common-args) none
[default] 
[default] -DDEBUGGING
[default] -Duse64bitall
[default] -DDEBUGGING -Duse64bitall
[default] -Duseithreads
[default] -DDEBUGGING -Duseithreads
[default] -Duseithreads -Duse64bitall
[default] -DDEBUGGING -Duseithreads -Duse64bitall
../cpan/Encode/t/truncated_utf8.t...........................PASSED
    9

Compiler messages(gcc):
/home/core/tmp/try-fe33af.o: In function `main':
./const-c.inc:351:42: warning: unused parameter 'iv_return' [-Wunused-parameter]
/home/core/tmp/try-c41517.o: In function `main':
/home/core/smoke/perl-current/UU/try.c:51: warning: sprintf() is often misused, please use snprintf()
/home/core/tmp/try-457e79.o: In function `main':
/home/core/tmp/try-2b4984.o: In function `main':
/home/core/tmp/try-456236.o: In function `main':
/home/core/tmp/try-733967.o: In function `main':
/home/core/tmp/try-70360b.o: In function `main':
/home/core/tmp/try-01a83f.o: In function `main':

Non-Fatal messages(gcc):



-- 
Report by Test::Smoke v1.71 running on perl 5.26.1
(Reporter v0.053 / Smoker v0.046)



nntp.perl.org: Perl Programming lists via nntp and http.
Comments to Ask Bjørn Hansen at ask@perl.org | Group listing | About