develooper Front page | perl.daily-build.reports | Postings from April 2018

Smoke [smoke-me/khw-coverity] v5.27.10-107-gc183786972 FAIL(F)openbsd 6.3 (amd64/1 cpu)

From:
Carlos Guevara
Date:
April 7, 2018 00:10
Subject:
Smoke [smoke-me/khw-coverity] v5.27.10-107-gc183786972 FAIL(F)openbsd 6.3 (amd64/1 cpu)
Message ID:
0d9d2e5beaed3b47@cjg-openbsd6
Automated smoke report for branch smoke-me/khw-coverity 5.27.11 patch c183786972addbd5d4cfbe94809973410792fd73 v5.27.10-107-gc183786972
cjg-openbsd6: Intel(R) Xeon(R) CPU E5420 @ 2.50GHz (2502 MHz) (amd64/1 cpu)
    on        openbsd - 6.3
    using     cc version 4.2.1 Compatible OpenBSD Clang 5.0.1 (tags/RELEASE_501/final)
    smoketime 15 hours 49 minutes (average 1 hour 58 minutes)

Summary: FAIL(F)

O = OK  F = Failure(s), extended report at the bottom
X = Failure(s) under TEST but not under harness
? = still running or test results not (yet) available
Build failures during:       - = unknown or N/A
c = Configure, m = make, M = make (after miniperl), t = make test-prep

v5.27.10-107-gc183786972  Configuration (common) none
----------- ---------------------------------------------------------
F F         
F F         -Duse64bitall
O F         -Duseithreads
F F         -Duseithreads -Duse64bitall
| +--------- -DDEBUGGING
+----------- no debugging


Locally applied patches:
    SMOKEc183786972addbd5d4cfbe94809973410792fd73

Testsuite was run only with 'harness'

Tests skipped on user request:
    # One test name on a line
Failures: (common-args) none
[default] 
[default] -Duse64bitall
[default] -DDEBUGGING -Duse64bitall
../t/run/locale.t...........................................FAILED
    38-39

[default] -DDEBUGGING
../t/run/locale.t...........................................FAILED
    38-39
../t/op/time.t..............................................FAILED
    2

[default] -DDEBUGGING -Duseithreads
[default] -Duseithreads -Duse64bitall
[default] -DDEBUGGING -Duseithreads -Duse64bitall
../t/op/time.t..............................................FAILED
    2

Passed Todo tests: (common-args) none
[default] 
[default] -DDEBUGGING
[default] -Duse64bitall
[default] -DDEBUGGING -Duse64bitall
[default] -Duseithreads
[default] -DDEBUGGING -Duseithreads
[default] -Duseithreads -Duse64bitall
[default] -DDEBUGGING -Duseithreads -Duse64bitall
../cpan/Encode/t/truncated_utf8.t...........................PASSED
    9

Compiler messages(gcc):
/home/core/tmp/try-900078.o: In function `main':
./const-c.inc:351:42: warning: unused parameter 'iv_return' [-Wunused-parameter]
/home/core/tmp/try-9156c3.o: In function `main':
/home/core/smoke/perl-current/UU/try.c:51: warning: sprintf() is often misused, please use snprintf()
/home/core/tmp/try-e4b5a5.o: In function `main':
/home/core/tmp/try-2a9289.o: In function `main':
/home/core/tmp/try-3e8899.o: In function `main':
/home/core/tmp/try-95dcd6.o: In function `main':
/home/core/tmp/try-bd09fc.o: In function `main':
/home/core/tmp/try-e48af3.o: In function `main':

Non-Fatal messages(gcc):



-- 
Report by Test::Smoke v1.71 running on perl 5.26.1
(Reporter v0.053 / Smoker v0.046)



nntp.perl.org: Perl Programming lists via nntp and http.
Comments to Ask Bjørn Hansen at ask@perl.org | Group listing | About