develooper Front page | perl.daily-build.reports | Postings from April 2018

Smoke [blead] v5.27.10-106-g2f49491f5d FAIL(F) openbsd 6.3 (amd64/1cpu)

From:
Carlos Guevara
Date:
April 5, 2018 12:18
Subject:
Smoke [blead] v5.27.10-106-g2f49491f5d FAIL(F) openbsd 6.3 (amd64/1cpu)
Message ID:
c913c5ee31ff59e1@cjg-openbsd6
Automated smoke report for branch blead 5.27.11 patch 2f49491f5d1c7c1014a5af26c13a743812995ee1 v5.27.10-106-g2f49491f5d
cjg-openbsd6: Intel(R) Xeon(R) CPU E5420 @ 2.50GHz (2407 MHz) (amd64/1 cpu)
    on        openbsd - 6.3
    using     cc version 4.2.1 Compatible OpenBSD Clang 5.0.1 (tags/RELEASE_501/final)
    smoketime 16 hours 4 minutes (average 2 hours)

Summary: FAIL(F)

O = OK  F = Failure(s), extended report at the bottom
X = Failure(s) under TEST but not under harness
? = still running or test results not (yet) available
Build failures during:       - = unknown or N/A
c = Configure, m = make, M = make (after miniperl), t = make test-prep

v5.27.10-106-g2f49491f5d  Configuration (common) none
----------- ---------------------------------------------------------
F F         
F F         -Duse64bitall
O O         -Duseithreads
O F         -Duseithreads -Duse64bitall
| +--------- -DDEBUGGING
+----------- no debugging


Locally applied patches:
    SMOKE2f49491f5d1c7c1014a5af26c13a743812995ee1

Testsuite was run only with 'harness'

Tests skipped on user request:
    # One test name on a line
Failures: (common-args) none
[default] 
[default] -DDEBUGGING
[default] -DDEBUGGING -Duse64bitall
../t/run/locale.t...........................................FAILED
    38-39

[default] -Duse64bitall
../t/run/locale.t...........................................FAILED
    38-39
../t/op/time.t..............................................FAILED
    2

[default] -DDEBUGGING -Duseithreads -Duse64bitall
../t/op/time.t..............................................FAILED
    2

Passed Todo tests: (common-args) none
[default] 
[default] -DDEBUGGING
[default] -Duse64bitall
[default] -DDEBUGGING -Duse64bitall
[default] -Duseithreads
[default] -DDEBUGGING -Duseithreads
[default] -Duseithreads -Duse64bitall
[default] -DDEBUGGING -Duseithreads -Duse64bitall
../cpan/Encode/t/truncated_utf8.t...........................PASSED
    9

Compiler messages(gcc):
/home/core/tmp/try-9d42e1.o: In function `main':
./const-c.inc:351:42: warning: unused parameter 'iv_return' [-Wunused-parameter]
/home/core/tmp/try-251cd6.o: In function `main':
/home/core/smoke/perl-current/UU/try.c:51: warning: sprintf() is often misused, please use snprintf()
/home/core/tmp/try-a01fa0.o: In function `main':
/home/core/tmp/try-d19968.o: In function `main':
/home/core/tmp/try-b7d629.o: In function `main':
/home/core/tmp/try-80f05e.o: In function `main':
/home/core/tmp/try-ae7d35.o: In function `main':
/home/core/tmp/try-5a4852.o: In function `main':

Non-Fatal messages(gcc):



-- 
Report by Test::Smoke v1.71 running on perl 5.26.1
(Reporter v0.053 / Smoker v0.046)



nntp.perl.org: Perl Programming lists via nntp and http.
Comments to Ask Bjørn Hansen at ask@perl.org | Group listing | About