develooper Front page | perl.daily-build.reports | Postings from April 2018

Smoke [5.27.11] v5.27.10-106-g2f49491f5d FAIL(F) openvms V8.4-2L1(IA64/2 cpu)

From:
Craig A. Berry
Date:
April 5, 2018 06:28
Subject:
Smoke [5.27.11] v5.27.10-106-g2f49491f5d FAIL(F) openvms V8.4-2L1(IA64/2 cpu)
Message ID:
423158.69671026-sendEmail@alma
Automated smoke report for 5.27.11 patch 2f49491f5d1c7c1014a5af26c13a743812995ee1 v5.27.10-106-g2f49491f5d
ALMA: HP rx2660  (1.67GHz/9.0MB) (IA64/2 cpu)
    on        openvms - V8.4-2L1
    using     VSI C V7.4-001

    smoketime 2 hours 57 minutes (average 1 hour 28 minutes)

Summary: FAIL(F)

O = OK  F = Failure(s), extended report at the bottom
X = Failure(s) under TEST but not under harness
? = still running or test results not (yet) available
Build failures during:       - = unknown or N/A
c = Configure, m = make, M = make (after miniperl), t = make test-prep

v5.27.10-106-g2f49491f5d  Configuration (common) none
----------- ---------------------------------------------------------
F -         
F -         -Duseithreads
| +--------- -DDEBUGGING
+----------- no debugging


Locally applied patches:
    SMOKE2f49491f5d1c7c1014a5af26c13a743812995ee1

Failures: (common-args) none
[default] 
    cpan/Test-Harness/t/proverun ................................... FAILED at test 3

[default] -Duseithreads
    t/op/chdir ..................................................... FAILED at test 28
    cpan/Test-Harness/t/proverun ................................... FAILED at test 3

MANIFEST did not declare 'CPAN/LOCALE-CODES/T/ERRORS^.1.T'
MANIFEST did not declare 'CPAN/LOCALE-CODES/T/ERRORS^.2.T'
MANIFEST declared 'CPAN/LOCALE-CODES/T/ERRORS_1.T' but it is missing
MANIFEST declared 'CPAN/LOCALE-CODES/T/ERRORS_2.T' but it is missing
MANIFEST did not declare 'CPAN/PARENT/T/RT62341^.T.DISABLED'
MANIFEST declared 'CPAN/PARENT/T/RT62341_T.DISABLED' but it is missing
MANIFEST did not declare 'CPAN/^.DIR-LOCALS.EL'
MANIFEST declared 'CPAN/_DIR-LOCALS.EL' but it is missing
MANIFEST did not declare 'CROSS/MAKEFILE^.SH.PATCH'
MANIFEST declared 'CROSS/MAKEFILE_SH.PATCH' but it is missing
MANIFEST did not declare 'DIST/STORABLE/STORABLE^.PM.PL'
MANIFEST declared 'DIST/STORABLE/STORABLE_PM.PL' but it is missing
MANIFEST did not declare '^.DIR-LOCALS.EL'
MANIFEST did not declare '^.METACONF-EXCLUSIONS.TXT'
MANIFEST did not declare '^.TRAVIS.YML'
MANIFEST declared '_DIR-LOCALS.EL' but it is missing
MANIFEST declared '_METACONF-EXCLUSIONS.TXT' but it is missing
MANIFEST declared '_TRAVIS.YML' but it is missing

Compiler messages(VMS):

	    neg = PL_statcache.st_ino < 0;
.................^
%CC-I-QUESTCOMPARE, In this statement, the unsigned expression "(my_perl->Istatcache).st_ino" is being compared with a relational operator to a constant whose value is not greater than zero.  This might not be what you intended.
at line number 2997 in file SMOKE_BUILD_ROOT:[blead]pp_sys.c;1

        return len - (STRLEN)(s->posn) <= 0;
..............^
%CC-I-QUESTCOMPARE, In this statement, the unsigned expression "len-(STRLEN)(s->posn)" is being compared with a relational operator to a constant whose value is not greater than zero.  This might not be what you intended.
at line number 25 in file SMOKE_BUILD_ROOT:[blead.ext.PerlIO-scalar]scalar.xs;1

-- 
Report by Test::Smoke v1.53 build 1374 running on perl 5.24.2
(Reporter v0.050 / Smoker v0.045)




nntp.perl.org: Perl Programming lists via nntp and http.
Comments to Ask Bjørn Hansen at ask@perl.org | Group listing | About