develooper Front page | perl.daily-build.reports | Postings from April 2018

Smoke [5.27.11] v5.27.10-104-g588dc62f36 FAIL(X) linux 4.9.59-v7+[debian] (armv7l/4 cpu)

From:
njh
Date:
April 4, 2018 08:46
Subject:
Smoke [5.27.11] v5.27.10-104-g588dc62f36 FAIL(X) linux 4.9.59-v7+[debian] (armv7l/4 cpu)
Message ID:
20180404084617.CD9BE23FBF12@ps395777.dreamhostps.com
Automated smoke report for 5.27.11 patch 588dc62f36ae80fd7faab556b663a2e97eaa8788 v5.27.10-104-g588dc62f36
pi2: ARMv7 Processor rev 5 (v7l) ( 0MHz) (armv7l/4 cpu)
    on        linux - 4.9.59-v7+ [debian]
    using      gcc-6 version 6.3.0 20170516
    smoketime 3 hours 21 minutes (average 3 hours 21 minutes)

Summary: FAIL(X)

O = OK  F = Failure(s), extended report at the bottom
X = Failure(s) under TEST but not under harness
? = still running or test results not (yet) available
Build failures during:       - = unknown or N/A
c = Configure, m = make, M = make (after miniperl), t = make test-prep

v5.27.10-104-g588dc62f36  Configuration (common) -Acc=gcc-6 -Accflags="-O2"
----------- ---------------------------------------------------------
X -         
| +--------- -DDEBUGGING
+----------- no debugging


Locally applied patches:
    SMOKE588dc62f36ae80fd7faab556b663a2e97eaa8788

Failures: (common-args) -Acc=gcc-6 -Accflags="-O2"
[default] 
Inconsistent test results (between TEST and harness):
    ../t/cpan/IO-Compress/t/cz-08encoding.t. ............................... FAILED at test 7
    ../t/dist/base/t/base-open-chunk.t...... .................................... FAILED at test 14
    ../t/op/tr.t............................ ........................................................ FAILED at test 48
    ../ext/XS-APItest/t/fetch_pad_names.t... ............................... FAILED--no leader found
    ../t/cpan/Unicode-Collate/t/index.t..... ................................... FAILED at test 10
    ../ext/XS-APItest/t/utf8.t.............. .......................................... FAILED at test 57
    ../t/re/regexp_nonull.t................. ............................................. FAILED--no leader found
    ../t/uni/overload.t..................... ................................................. FAILED--no leader found
    ../t/cpan/Digest-MD5/t/utf8.t........... ......................................... FAILED--non-zero wait status: 6
    ../t/re/regexp_qr.t..................... ................................................. FAILED--no leader found
    ../t/re/regexp_trielist.t............... ........................................... FAILED--no leader found
    ../t/op/read.t.......................... ...................................................... FAILED--no leader found
    ../ext/XS-APItest/t/hash.t.............. .......................................... FAILED--no leader found
    ../t/re/pat_advanced.t.................. .............................................. FAILED at test 304
    ../t/op/sprintf2.t...................... .................................................. FAILED--no leader found
    ../lib/feature/unicode_strings.t........ .................................... FAILED at test 5845
    ../t/cpan/Unicode-Collate/t/loc_test.t.. ................................ FAILED at test 104
    ../t/op/index.t......................... ..................................................... FAILED at test 45
    ../t/re/regexp_notrie.t................. ............................................. FAILED--no leader found
    ../t/op/write.t......................... ..................................................... FAILED--no leader found
    ../t/re/regexp.t........................ .................................................... FAILED--no leader found
    ../t/cpan/JSON-PP/t/zero-mojibake.t..... ................................... FAILED at test 1
    ../t/cpan/Encode/t/fallback.t........... ......................................... FAILED at test 1
    ../t/re/regexp_qr_embed.t............... ........................................... FAILED--no leader found
    ../t/cpan/JSON-PP/t/099_binary.t........ ...................................... FAILED--expected 2432 tests, saw 234
    ../t/dist/Data-Dumper/t/dumper.t........ ...................................... FAILED at test 385
    ../t/re/fold_grind.t.................... ................................................ FAILED--no leader found
    ../ext/XS-APItest/t/utf8_to_bytes.t..... ................................. FAILED--no leader found
    ../t/dist/base/t/base-open-line.t....... ..................................... FAILED at test 14
    ../t/re/regexp_noamp.t.................. .............................................. FAILED--no leader found

Compiler messages(gcc):
inline.h: In function ‘S_variant_under_utf8_count’:
inline.h:647:21: warning: right shift count >= width of type [-Wshift-count-overflow]
../../inline.h: In function ‘S_variant_under_utf8_count’:
../../inline.h:647:21: warning: right shift count >= width of type [-Wshift-count-overflow]
ODBM_File.c: In function ‘XS_ODBM_File_DELETE’:
ODBM_File.xs:64:31: warning: identifier ‘delete’ conflicts with C++ keyword [-Wc++-compat]
Storable.xs: In function ‘store_ref’:
Storable.xs:706:18: warning: format ‘%ld’ expects argument of type ‘long int’, but argument 3 has type ‘STRLEN {aka unsigned int}’ [-Wformat=]
Storable.xs: In function ‘store_scalar’:
Storable.xs: In function ‘store_array’:
Storable.xs: In function ‘store_hash’:
Storable.xs: In function ‘store_hentry’:
Storable.xs: In function ‘store_code’:
Storable.xs: In function ‘get_regexp’:
Storable.xs:3406:14: warning: format ‘%d’ expects argument of type ‘int’, but argument 2 has type ‘I32 {aka long int}’ [-Wformat=]
Storable.xs: In function ‘store_regexp’:
Storable.xs: In function ‘store_tied’:
Storable.xs: In function ‘store_tied_item’:
Storable.xs: In function ‘store_hook’:
Storable.xs: In function ‘store_blessed’:
Storable.xs: In function ‘store_other’:
Storable.xs: In function ‘store’:
Storable.xs: In function ‘magic_write’:
Storable.xs: In function ‘retrieve_regexp’:
Storable.xs:6821:16: warning: format ‘%d’ expects argument of type ‘int’, but argument 2 has type ‘I32 {aka long int}’ [-Wformat=]

-- 
Report by Test::Smoke v1.53 build 1374 running on perl 5.24.1
(Reporter v0.050 / Smoker v0.045)



nntp.perl.org: Perl Programming lists via nntp and http.
Comments to Ask Bjørn Hansen at ask@perl.org | Group listing | About