develooper Front page | perl.daily-build.reports | Postings from April 2018

Smoke [blead] v5.27.10-103-ge39a413022 FAIL(FMm) HP-UX B.11.23/64(ia64/2 cpu)

From:
H.Merijn Brand
Date:
April 4, 2018 05:23
Subject:
Smoke [blead] v5.27.10-103-ge39a413022 FAIL(FMm) HP-UX B.11.23/64(ia64/2 cpu)
Message ID:
MAILD177E8F3@mail.procura.nl
Automated smoke report for branch blead 5.27.11 patch e39a41302266ba11423cb88bb253d4879250082e v5.27.10-103-ge39a413022
x1: Intel(R) Itanium 2 processor/1600 MHz (ia64/2 cpu)
    on        HP-UX - B.11.23/64
    using     ccache cc version B3910B A.06.25.02
    smoketime 8 hours 37 minutes (average 1 hour 4 minutes)

Summary: FAIL(FMm)

O = OK  F = Failure(s), extended report at the bottom
X = Failure(s) under TEST but not under harness
? = still running or test results not (yet) available
Build failures during:       - = unknown or N/A
c = Configure, m = make, M = make (after miniperl), t = make test-prep

v5.27.10-103-ge39a413022  Configuration (common) none
----------- ---------------------------------------------------------
M - - F F F 
O O O O O O -Duse64bitall
m - - M - - -Duseithreads
O O O O O O -Duseithreads -Duse64bitall
| | | | | +- LC_ALL = en_US.utf8 -DDEBUGGING
| | | | +--- PERLIO = perlio -DDEBUGGING
| | | +----- PERLIO = stdio  -DDEBUGGING
| | +------- LC_ALL = en_US.utf8
| +--------- PERLIO = perlio
+----------- PERLIO = stdio 

Locally applied patches:
    SMOKEe39a41302266ba11423cb88bb253d4879250082e

Testsuite was run only with 'harness'

Tests skipped on user request:
    lib/Test/Simple/t/utf8.t
Failures: (common-args) none
[stdio] -DDEBUGGING
../t/re/pat_advanced.t......................................FAILED
    895
../t/op/index.t.............................................FAILED
    45-50
../t/op/read.t..............................................FAILED
    222, 224, 226, 228, 230, 232, 234, 236
    238, 240, 242, 244, 246, 248, 250, 252
    254, 256, 258, 260, 262, 264, 266, 268
    270, 272, 274, 276, 750, 752, 754, 756
    758, 760, 762, 764, 766, 768, 770, 772
    774, 776, 778, 780, 782, 784, 786, 788
    790, 792, 794, 796, 798, 800, 802, 804
    1278, 1280, 1282, 1284, 1286, 1288, 1290
    1292, 1294, 1296, 1298, 1300, 1302, 1304
    1306, 1308, 1310, 1312, 1314, 1316, 1318
    1320, 1322, 1324, 1326, 1328, 1330, 1332
    1670, 1672, 1674, 1676, 1678, 1680, 1682
    1684, 1686
    Non-zero exit status: 255
    Bad plan.  You planned 2116 tests but ran 1686.
../t/op/sprintf2.t..........................................FAILED
    6-8
../t/op/tr.t................................................FAILED
    48-86
../t/uni/overload.t.........................................FAILED
    156
    Non-zero exit status: 255
    Bad plan.  You planned 217 tests but ran 156.
../cpan/Encode/t/fallback.t.................................FAILED
    1, 13-14, 17-19, 23, 29, 33, 37, 41
../cpan/IO-Compress/t/cz-08encoding.t.......................FAILED
    7-8
    Non-zero exit status: 2
../cpan/JSON-PP/t/099_binary.t..............................FAILED
    Non-zero exit status: 255
    Bad plan.  You planned 2432 tests but ran 234.
../cpan/JSON-PP/t/zero-mojibake.t...........................FAILED
    1
    Non-zero exit status: 1
../dist/base/t/base-open-chunk.t............................FAILED
    14
    Non-zero exit status: 1
../dist/base/t/base-open-line.t.............................FAILED
    14
    Non-zero exit status: 1
../dist/Data-Dumper/t/dumper.t..............................FAILED
    385, 387-388, 390
../ext/XS-APItest/t/hash.t..................................FAILED
    968, 972, 977, 982, 984, 987, 990, 1079
    1083, 1088, 1093, 1095, 1098, 1101, 1157
    1172, 1175, 1190, 1194, 1199
    Non-zero exit status: 20
../ext/XS-APItest/t/utf8_to_bytes.t.........................FAILED
    6-9
../ext/XS-APItest/t/utf8.t..................................FAILED
    57, 64-318
    Non-zero exit status: 254
../lib/feature/unicode_strings.t............................FAILED
    11627, 11775, 12139, 12287, 13163, 13311

[perlio] -DDEBUGGING
../t/re/pat_advanced.t......................................FAILED
    895
../t/op/sprintf2.t..........................................FAILED
    6-8
../t/op/read.t..............................................FAILED
    222, 224, 226, 228, 230, 232, 234, 236
    238, 240, 242, 244, 246, 248, 250, 252
    254, 256, 258, 260, 262, 264, 266, 268
    270, 272, 274, 276, 750, 752, 754, 756
    758, 760, 762, 764, 766, 768, 770, 772
    774, 776, 778, 780, 782, 784, 786, 788
    790, 792, 794, 796, 798, 800, 802, 804
    1278, 1280, 1282, 1284, 1286, 1288, 1290
    1292, 1294, 1296, 1298, 1300, 1302, 1304
    1306, 1308, 1310, 1312, 1314, 1316, 1318
    1320, 1322, 1324, 1326, 1328, 1330, 1332
    1670, 1672, 1674, 1676, 1678, 1680, 1682
    1684, 1686
    Non-zero exit status: 255
    Bad plan.  You planned 2116 tests but ran 1686.
../t/op/tr.t................................................FAILED
    48-86
../t/op/index.t.............................................FAILED
    45-50
../t/uni/overload.t.........................................FAILED
    156
    Non-zero exit status: 255
    Bad plan.  You planned 217 tests but ran 156.
../cpan/IO-Compress/t/cz-08encoding.t.......................FAILED
    7-8
    Non-zero exit status: 2
../ext/XS-APItest/t/utf8.t..................................FAILED
    57, 64-318
    Non-zero exit status: 254
../cpan/Encode/t/fallback.t.................................FAILED
    1, 13-14, 17-19, 23, 29, 33, 37, 41
../lib/feature/unicode_strings.t............................FAILED
    11627, 11775, 12139, 12287, 13163, 13311
../cpan/JSON-PP/t/099_binary.t..............................FAILED
    Non-zero exit status: 255
    Bad plan.  You planned 2432 tests but ran 234.
../cpan/JSON-PP/t/zero-mojibake.t...........................FAILED
    1
    Non-zero exit status: 1
../dist/Data-Dumper/t/dumper.t..............................FAILED
    385, 387-388, 390
../ext/XS-APItest/t/utf8_to_bytes.t.........................FAILED
    6-9
../ext/XS-APItest/t/hash.t..................................FAILED
    968, 1046, 1079, 1083, 1157, 1169, 1172
    1175, 1190, 1194, 1199, 1204, 1206, 1209
    1212
    Non-zero exit status: 15
../dist/base/t/base-open-chunk.t............................FAILED
    14
    Non-zero exit status: 1
../dist/base/t/base-open-line.t.............................FAILED
    14
    Non-zero exit status: 1

[en_US.utf8] -DDEBUGGING
../t/re/pat_advanced.t......................................FAILED
    895
../t/op/sprintf2.t..........................................FAILED
    6-8
../t/op/read.t..............................................FAILED
    158, 160, 162, 164, 166, 168, 170, 172
    174, 176, 178, 180, 182, 184, 186, 188
    190, 192, 194, 196, 198, 200, 202, 204
    206, 208, 210, 212, 222, 224, 226, 228
    230, 232, 234, 236, 238, 240, 242, 244
    246, 248, 250, 252, 254, 256, 258, 260
    262, 264, 266, 268, 270, 272, 274, 276
    686, 688, 690, 692, 694, 696, 698, 700
    702, 704, 706, 708, 710, 712, 714, 716
    718, 720, 722, 724, 726, 728, 730, 732
    734, 736, 738, 740, 750, 752, 754, 756
    758, 760, 762, 764, 766, 768, 770, 772
    774, 776, 778, 780, 782, 784, 786, 788
    790, 792, 794, 796, 798, 800, 802, 804
    1214, 1216, 1218, 1220, 1222, 1224, 1226
    1228, 1230, 1232, 1234, 1236, 1238, 1240
    1242, 1244, 1246, 1248, 1250, 1252, 1254
    1256, 1258, 1260, 1262, 1264, 1266, 1268
    1278, 1280, 1282, 1284, 1286, 1288, 1290
    1292, 1294, 1296, 1298, 1300, 1302, 1304
    1306, 1308, 1310, 1312, 1314, 1316, 1318
    1320, 1322, 1324, 1326, 1328, 1330, 1332
    1670, 1672, 1674, 1676, 1678, 1680, 1682
    1684, 1686
    Non-zero exit status: 255
    Bad plan.  You planned 2116 tests but ran 1686.
../t/op/tr.t................................................FAILED
    48-86
../t/op/index.t.............................................FAILED
    45-50
../t/uni/overload.t.........................................FAILED
    156
    Non-zero exit status: 255
    Bad plan.  You planned 217 tests but ran 156.
../cpan/IO-Compress/t/cz-08encoding.t.......................FAILED
    7-8
    Non-zero exit status: 2
../cpan/Encode/t/fallback.t.................................FAILED
    1, 13-14, 17-18, 23, 29, 33, 37, 41
../ext/XS-APItest/t/utf8.t..................................FAILED
    57, 64-318
    Non-zero exit status: 254
../lib/feature/unicode_strings.t............................FAILED
    11627, 11775, 12139, 12287, 13163, 13311
../cpan/JSON-PP/t/099_binary.t..............................FAILED
    Non-zero exit status: 255
    Bad plan.  You planned 2432 tests but ran 234.
../cpan/JSON-PP/t/zero-mojibake.t...........................FAILED
    1
    Non-zero exit status: 1
../dist/Data-Dumper/t/dumper.t..............................FAILED
    385, 387-388, 390
../ext/XS-APItest/t/utf8_to_bytes.t.........................FAILED
    6-9
../ext/XS-APItest/t/hash.t..................................FAILED
    935, 947, 950, 953, 968, 972, 977, 982
    984, 987, 990, 1046, 1061, 1064, 1079, 1157
    1169, 1172, 1175, 1190, 1194, 1199
    Non-zero exit status: 22
../dist/base/t/base-open-chunk.t............................FAILED
    14
    Non-zero exit status: 1
../dist/base/t/base-open-line.t.............................FAILED
    14
    Non-zero exit status: 1

Passed Todo tests: (common-args) none
[stdio/perlio] -DDEBUGGING
[stdio/perlio] -Duse64bitall
[stdio/perlio] -DDEBUGGING -Duse64bitall
[stdio/perlio] -Duseithreads -Duse64bitall
[stdio/perlio] -DDEBUGGING -Duseithreads -Duse64bitall
../cpan/Encode/t/truncated_utf8.t...........................PASSED
    9
../dist/Net-Ping/t/450_service.t............................PASSED
    9, 18

[en_US.utf8] -DDEBUGGING
[en_US.utf8] -Duse64bitall
[en_US.utf8] -DDEBUGGING -Duse64bitall
[en_US.utf8] -Duseithreads -Duse64bitall
[en_US.utf8] -DDEBUGGING -Duseithreads -Duse64bitall
../lib/B/Deparse.t..........................................PASSED
    2
../cpan/Encode/t/truncated_utf8.t...........................PASSED
    9
../dist/Net-Ping/t/450_service.t............................PASSED
    9, 18

Compiler messages(hpux):


Non-Fatal messages(hpux):


Status overview available here: https://tux.nl/perl5/smoke/

-- 
Report by Test::Smoke v1.71_01 running on perl 5.14.2
(Reporter v0.053 / Smoker v0.046)



nntp.perl.org: Perl Programming lists via nntp and http.
Comments to Ask Bjørn Hansen at ask@perl.org | Group listing | About