develooper Front page | perl.daily-build.reports | Postings from March 2018

Smoke [smoke-me/khw-bram] v5.27.9-125-g12e7ecef0d PASS netbsd 7.1.1(amd64/1 cpu)

From:
Carlos Guevara
Date:
March 8, 2018 10:37
Subject:
Smoke [smoke-me/khw-bram] v5.27.9-125-g12e7ecef0d PASS netbsd 7.1.1(amd64/1 cpu)
Message ID:
20180308103718.78B9716C5C1@cjg-netbsd7
Automated smoke report for branch smoke-me/khw-bram 5.27.10 patch 12e7ecef0d13bb8eedcedc1a95df5680c637fef0 v5.27.9-125-g12e7ecef0d
cjg-netbsd7: Intel 686-class (amd64/1 cpu)
    on        netbsd - 7.1.1
    using     cc version 4.8.5
    smoketime 6 hours 40 minutes (average 50 minutes)

Summary: PASS

O = OK  F = Failure(s), extended report at the bottom
X = Failure(s) under TEST but not under harness
? = still running or test results not (yet) available
Build failures during:       - = unknown or N/A
c = Configure, m = make, M = make (after miniperl), t = make test-prep

v5.27.9-125-g12e7ecef0d  Configuration (common) none
----------- ---------------------------------------------------------
O O         
O O         -Duse64bitall
O O         -Duseithreads
O O         -Duseithreads -Duse64bitall
| +--------- -DDEBUGGING
+----------- no debugging


Locally applied patches:
    SMOKE12e7ecef0d13bb8eedcedc1a95df5680c637fef0

Testsuite was run only with 'harness'

Tests skipped on user request:
    # One test name on a line
Passed Todo tests: (common-args) none
[default] 
[default] -DDEBUGGING
[default] -Duse64bitall
[default] -DDEBUGGING -Duse64bitall
[default] -Duseithreads
[default] -DDEBUGGING -Duseithreads
[default] -Duseithreads -Duse64bitall
[default] -DDEBUGGING -Duseithreads -Duse64bitall
../cpan/Encode/t/truncated_utf8.t...........................PASSED
    9

Compiler messages(gcc):
regcomp.c: In function 'S_grok_bslash_N':
embed.h:603:54: warning: 'substitute_parse' may be used uninitialized in this function [-Wmaybe-uninitialized]
regcomp.c:12312:10: note: 'substitute_parse' was declared here
/usr/include/sys/cdefs_elf.h:67:20: error: missing binary operator before token "("
/usr/include/sys/cdefs_elf.h:73:20: error: missing binary operator before token "("
/usr/include/sys/cdefs_elf.h:79:20: error: missing binary operator before token "("
Socket.c: In function 'XS_Socket_pack_ip_mreq_source':
Socket.c:1654:7: warning: variable 'interface' set but not used [-Wunused-but-set-variable]
const-c.inc: In function 'constant_19':
const-c.inc:351:42: warning: unused parameter 'iv_return' [-Wunused-parameter]
Piece.xs: In function '_strptime':
Piece.xs:719:8: warning: 'len' may be used uninitialized in this function [-Wmaybe-uninitialized]
re_comp.c: In function 'S_grok_bslash_N':
../../embed.h:603:54: warning: 'substitute_parse' may be used uninitialized in this function [-Wmaybe-uninitialized]
re_comp.c:12312:10: note: 'substitute_parse' was declared here

Non-Fatal messages(gcc):



-- 
Report by Test::Smoke v1.71 running on perl 5.26.1
(Reporter v0.053 / Smoker v0.046)



nntp.perl.org: Perl Programming lists via nntp and http.
Comments to Ask Bjørn Hansen at ask@perl.org | Group listing | About