develooper Front page | perl.daily-build.reports | Postings from March 2018

Smoke [blead] v5.27.9-120-gfb7e725522 FAIL(F) openbsd 6.2 (amd64/1cpu)

From:
Carlos Guevara
Date:
March 7, 2018 14:34
Subject:
Smoke [blead] v5.27.9-120-gfb7e725522 FAIL(F) openbsd 6.2 (amd64/1cpu)
Message ID:
07b4d877e7e7922d@cjg-openbsd6
Automated smoke report for branch blead 5.27.10 patch fb7e725522eb400ba57f680cea29799ad5c8e4ac v5.27.9-120-gfb7e725522
cjg-openbsd6: Intel(R) Xeon(R) CPU E5420 @ 2.50GHz (2503 MHz) (amd64/1 cpu)
    on        openbsd - 6.2
    using     cc version 4.2.1 Compatible OpenBSD Clang 4.0.0 (tags/RELEASE_400/final)
    smoketime 15 hours 37 minutes (average 1 hour 57 minutes)

Summary: FAIL(F)

O = OK  F = Failure(s), extended report at the bottom
X = Failure(s) under TEST but not under harness
? = still running or test results not (yet) available
Build failures during:       - = unknown or N/A
c = Configure, m = make, M = make (after miniperl), t = make test-prep

v5.27.9-120-gfb7e725522  Configuration (common) none
----------- ---------------------------------------------------------
F F         
F F         -Duse64bitall
O O         -Duseithreads
O O         -Duseithreads -Duse64bitall
| +--------- -DDEBUGGING
+----------- no debugging


Locally applied patches:
    SMOKEfb7e725522eb400ba57f680cea29799ad5c8e4ac

Testsuite was run only with 'harness'

Tests skipped on user request:
    # One test name on a line
Failures: (common-args) none
[default] 
../t/run/locale.t...........................................FAILED
    38-39
../t/op/time.t..............................................FAILED
    2

[default] -DDEBUGGING
[default] -Duse64bitall
[default] -DDEBUGGING -Duse64bitall
../t/run/locale.t...........................................FAILED
    38-39

Passed Todo tests: (common-args) none
[default] 
[default] -DDEBUGGING
[default] -Duse64bitall
[default] -DDEBUGGING -Duse64bitall
[default] -Duseithreads
[default] -DDEBUGGING -Duseithreads
[default] -Duseithreads -Duse64bitall
[default] -DDEBUGGING -Duseithreads -Duse64bitall
../cpan/Encode/t/truncated_utf8.t...........................PASSED
    9

Compiler messages(gcc):
/home/core/tmp/try-083489.o: In function `main':
./const-c.inc:351:42: warning: unused parameter 'iv_return' [-Wunused-parameter]
/home/core/tmp/try-0a6aff.o: In function `main':
/home/core/smoke/perl-current/UU/try.c:51: warning: warning: sprintf() is often misused, please use snprintf()
/home/core/tmp/try-b523df.o: In function `main':
/home/core/tmp/try-90a826.o: In function `main':
/home/core/tmp/try-7959a7.o: In function `main':
/home/core/tmp/try-67f17a.o: In function `main':
/home/core/tmp/try-ace8d9.o: In function `main':
/home/core/tmp/try-c35a45.o: In function `main':

Non-Fatal messages(gcc):



-- 
Report by Test::Smoke v1.71 running on perl 5.26.1
(Reporter v0.053 / Smoker v0.046)



nntp.perl.org: Perl Programming lists via nntp and http.
Comments to Ask Bjørn Hansen at ask@perl.org | Group listing | About