develooper Front page | perl.daily-build.reports | Postings from March 2018

Smoke [blead] v5.27.9-119-ge1168c111a PASS netbsd 7.1.1 (amd64/1cpu)

From:
Carlos Guevara
Date:
March 7, 2018 02:14
Subject:
Smoke [blead] v5.27.9-119-ge1168c111a PASS netbsd 7.1.1 (amd64/1cpu)
Message ID:
20180307021402.6883516C5C2@cjg-netbsd7
Automated smoke report for branch blead 5.27.10 patch e1168c111a3dbbf8383f433d611b13168096d280 v5.27.9-119-ge1168c111a
cjg-netbsd7: Intel 686-class (amd64/1 cpu)
    on        netbsd - 7.1.1
    using     cc version 4.8.5
    smoketime 6 hours 37 minutes (average 49 minutes 44 seconds)

Summary: PASS

O = OK  F = Failure(s), extended report at the bottom
X = Failure(s) under TEST but not under harness
? = still running or test results not (yet) available
Build failures during:       - = unknown or N/A
c = Configure, m = make, M = make (after miniperl), t = make test-prep

v5.27.9-119-ge1168c111a  Configuration (common) none
----------- ---------------------------------------------------------
O O         
O O         -Duse64bitall
O O         -Duseithreads
O O         -Duseithreads -Duse64bitall
| +--------- -DDEBUGGING
+----------- no debugging


Locally applied patches:
    SMOKEe1168c111a3dbbf8383f433d611b13168096d280

Testsuite was run only with 'harness'

Tests skipped on user request:
    # One test name on a line
Passed Todo tests: (common-args) none
[default] 
[default] -DDEBUGGING
[default] -Duse64bitall
[default] -DDEBUGGING -Duse64bitall
[default] -Duseithreads
[default] -DDEBUGGING -Duseithreads
[default] -Duseithreads -Duse64bitall
[default] -DDEBUGGING -Duseithreads -Duse64bitall
../cpan/Encode/t/truncated_utf8.t...........................PASSED
    9

Compiler messages(gcc):
/usr/include/sys/cdefs_elf.h:67:20: error: missing binary operator before token "("
/usr/include/sys/cdefs_elf.h:73:20: error: missing binary operator before token "("
/usr/include/sys/cdefs_elf.h:79:20: error: missing binary operator before token "("
Socket.c: In function 'XS_Socket_pack_ip_mreq_source':
Socket.c:1654:7: warning: variable 'interface' set but not used [-Wunused-but-set-variable]
const-c.inc: In function 'constant_19':
const-c.inc:351:42: warning: unused parameter 'iv_return' [-Wunused-parameter]
Piece.xs: In function '_strptime':
Piece.xs:719:8: warning: 'len' may be used uninitialized in this function [-Wmaybe-uninitialized]

Non-Fatal messages(gcc):



-- 
Report by Test::Smoke v1.71 running on perl 5.26.1
(Reporter v0.053 / Smoker v0.046)



nntp.perl.org: Perl Programming lists via nntp and http.
Comments to Ask Bjørn Hansen at ask@perl.org | Group listing | About