develooper Front page | perl.daily-build.reports | Postings from February 2018

Smoke [5.27.9] v5.27.8-345-g54a4d58122 FAIL(X) linux4.14.13-mainline-rev1 [debian] (aarch64/4 cpu)

From:
kalidev2013
Date:
February 20, 2018 19:24
Subject:
Smoke [5.27.9] v5.27.8-345-g54a4d58122 FAIL(X) linux4.14.13-mainline-rev1 [debian] (aarch64/4 cpu)
Message ID:
E1eoDWQ-00030s-Bj@scaleway.teada.net
Automated smoke report for 5.27.9 patch 54a4d58122fe7419254a10dc01459c2956767a30 v5.27.8-345-g54a4d58122
scaleway:  ( 0MHz) (aarch64/4 cpu)
    on        linux - 4.14.13-mainline-rev1 [debian]
    using      gcc-6 version 6.3.0 20170516
    smoketime 11 hours (average 1 hour 22 minutes)

Summary: FAIL(X)

O = OK  F = Failure(s), extended report at the bottom
X = Failure(s) under TEST but not under harness
? = still running or test results not (yet) available
Build failures during:       - = unknown or N/A
c = Configure, m = make, M = make (after miniperl), t = make test-prep

v5.27.8-345-g54a4d58122  Configuration (common) -Acc=gcc-6
----------- ---------------------------------------------------------
O -         -Accflags="-O2" -Duseithreads
O -         -Accflags="-O2" -Duseithreads -Duse64bitint
X -         -Accflags="-O2" -Duseithreads -Duselongdouble
X -         -Accflags="-O2" -Duseithreads -Dusemorebits
O -         -Accflags="-O2 -Wall" -Duseithreads
O -         -Accflags="-O2 -Wall" -Duseithreads -Duse64bitint
X -         -Accflags="-O2 -Wall" -Duseithreads -Duselongdouble
? -         -Accflags="-O2 -Wall" -Duseithreads -Dusemorebits
| +--------- -DDEBUGGING
+----------- no debugging


Locally applied patches:
    SMOKE54a4d58122fe7419254a10dc01459c2956767a30

Failures: (common-args) -Acc=gcc-6
[default] -Accflags="-O2" -Duseithreads -Duselongdouble
[default] -Accflags="-O2 -Wall" -Duseithreads -Duselongdouble
Inconsistent test results (between TEST and harness):
    ../lib/File/Copy.t...................... .................................................. FAILED at test 53

[default] -Accflags="-O2" -Duseithreads -Dusemorebits
Inconsistent test results (between TEST and harness):
    ../lib/File/Copy.t...................... .................................................. FAILED at test 53
    ../t/re/fold_grind.t.................... ................................................ FAILED--no leader found

Compiler messages(gcc):
make ...ODBM_File.c: In function ‘XS_ODBM_File_DELETE’:
ODBM_File.xs:64:31: warning: identifier ‘delete’ conflicts with C++ keyword [-Wc++-compat]

-- 
Report by Test::Smoke v1.53 build 1374 running on perl 5.24.1
(Reporter v0.050 / Smoker v0.045)



nntp.perl.org: Perl Programming lists via nntp and http.
Comments to Ask Bjørn Hansen at ask@perl.org | Group listing | About