develooper Front page | perl.daily-build.reports | Postings from February 2018

Smoke [5.27.9] v5.27.8-241-g0a9f8f9511 FAIL(X) linux4.14.13-mainline-rev1 [debian] (aarch64/4 cpu)

From:
kalidev2013
Date:
February 9, 2018 19:24
Subject:
Smoke [5.27.9] v5.27.8-241-g0a9f8f9511 FAIL(X) linux4.14.13-mainline-rev1 [debian] (aarch64/4 cpu)
Message ID:
E1ekEHc-0003jh-LC@scaleway.teada.net
Automated smoke report for 5.27.9 patch 0a9f8f95112ff40e13406b3e5aab49c01487f045 v5.27.8-241-g0a9f8f9511
scaleway:  ( 0MHz) (aarch64/4 cpu)
    on        linux - 4.14.13-mainline-rev1 [debian]
    using      gcc-6 version 6.3.0 20170516
    smoketime 11 hours 54 minutes (average 1 hour 19 minutes)

Summary: FAIL(X)

O = OK  F = Failure(s), extended report at the bottom
X = Failure(s) under TEST but not under harness
? = still running or test results not (yet) available
Build failures during:       - = unknown or N/A
c = Configure, m = make, M = make (after miniperl), t = make test-prep

v5.27.8-241-g0a9f8f9511  Configuration (common) -Acc=gcc-6
----------- ---------------------------------------------------------
X -         -Accflags="-O2" -Duseithreads
X -         -Accflags="-O2" -Duseithreads -Duse64bitint
X -         -Accflags="-O2" -Duseithreads -Duselongdouble
X -         -Accflags="-O2" -Duseithreads -Dusemorebits
X -         -Accflags="-O2 -Wall" -Duseithreads
X -         -Accflags="-O2 -Wall" -Duseithreads -Duse64bitint
X -         -Accflags="-O2 -Wall" -Duseithreads -Duselongdouble
X -         -Accflags="-O2 -Wall" -Duseithreads -Dusemorebits
- -         -Accflags="-O2 -W -Wformat=2 -Wswitch -Wshadow -Wwrite-strings -Wuninitialized -Wall -pipe -fomit-frame-pointer -D_FORTIFY_SOURCE=2 -Wpointer-arith -Wstrict-prototypes -fstack-protector -Wstack-protector -Wextra -Wbad-function-cast -Wcast-align -Wdisabled-optimization -Wendif-labels -Wfloat-equal -Wformat-nonliteral -Winline -Wmissing-declarations -Wmissing-prototypes -Wnested-externs -Wpointer-arith -Wundef -Wformat-security -march=armv8-a+crc" -Duseithreads
| +--------- -DDEBUGGING
+----------- no debugging


Locally applied patches:
    SMOKE0a9f8f95112ff40e13406b3e5aab49c01487f045

Failures: (common-args) -Acc=gcc-6
[default] -Accflags="-O2" -Duseithreads
[default] -Accflags="-O2" -Duseithreads -Duse64bitint
[default] -Accflags="-O2 -Wall" -Duseithreads
[default] -Accflags="-O2 -Wall" -Duseithreads -Duse64bitint
Inconsistent test results (between TEST and harness):
    ../ext/I18N-Langinfo/t/Langinfo.t....... ................................... FAILED--non-zero wait status: 11

[default] -Accflags="-O2" -Duseithreads -Duselongdouble
[default] -Accflags="-O2" -Duseithreads -Dusemorebits
[default] -Accflags="-O2 -Wall" -Duseithreads -Dusemorebits
Inconsistent test results (between TEST and harness):
    ../ext/I18N-Langinfo/t/Langinfo.t....... ................................... FAILED--non-zero wait status: 11
    ../lib/File/Copy.t...................... .................................................. FAILED at test 53

[default] -Accflags="-O2 -Wall" -Duseithreads -Duselongdouble
Inconsistent test results (between TEST and harness):
    ../lib/File/Copy.t...................... .................................................. FAILED at test 53
    ../ext/I18N-Langinfo/t/Langinfo.t....... ................................... FAILED--non-zero wait status: 11

Compiler messages(gcc):
make ...ODBM_File.c: In function ‘XS_ODBM_File_DELETE’:
ODBM_File.xs:64:31: warning: identifier ‘delete’ conflicts with C++ keyword [-Wc++-compat]
APItest.xs: In function ‘XS_XS__APItest__utf8_test_utf8_to_bytes’:
APItest.xs:1392:45: warning: pointer targets in passing argument 3 of ‘Perl_utf8_to_bytes’ differ in signedness [-Wpointer-sign]
Configure ...try.c: In function ‘main’:
try.c: In function ‘main’:
try.c: In function ‘blech’:
try.c: In function ‘blech_in_list’:
try.c: In function ‘bletch’:
signal.c:8:5: warning: function declaration isn’t a prototype [-Wstrict-prototypes]
perl.h:1296:5: warning: "VMS" is not defined [-Wundef]
inline.h: In function ‘S_cx_popsub_args’:
handy.h:57:35: warning: declaration of ‘_p’ shadows a previous local [-Wshadow]
gv.c: In function ‘S_gv_fetchmeth_internal’:
gv.c:810:29: warning: declaration of ‘hvname’ shadows a previous local [-Wshadow]
toke.c: In function ‘Perl_lex_start’:
op.c: In function ‘Perl_scalarvoid’:
op.c:2090:61: warning: comparing floating point with == or != is unsafe [-Wfloat-equal]
op.c:2090:74: warning: comparing floating point with == or != is unsafe [-Wfloat-equal]
gv.c: In function ‘S_require_tie_mod’:
pp.h:81:19: warning: declaration of ‘sp’ shadows a previous local [-Wshadow]
gv.c: In function ‘S_parse_gv_stash_name’:
op.c: In function ‘S_maybe_multiconcat’:
op.c:3070:19: warning: declaration of ‘p’ shadows a previous local [-Wshadow]
perl.c: In function ‘perl_destruct’:
perl.c:655:17: warning: declaration of ‘i’ shadows a previous local [-Wshadow]
op.c:3274:28: warning: declaration of ‘p’ shadows a previous local [-Wshadow]
cop.h:115:10: warning: declaration of ‘i’ shadows a previous local [-Wshadow]
cop.h:132:10: warning: declaration of ‘i’ shadows a previous local [-Wshadow]
perl.c:962:6: warning: declaration of ‘i’ shadows a previous local [-Wshadow]
perl.c:999:6: warning: declaration of ‘i’ shadows a previous local [-Wshadow]
toke.c: In function ‘S_incline’:
perl.c:1362:13: warning: declaration of ‘i’ shadows a previous local [-Wshadow]
op.c: In function ‘Perl_op_lvalue_flags’:
op.c:3960:7: warning: declaration of ‘kid’ shadows a previous local [-Wshadow]
perl.c: In function ‘Perl_require_pv’:
gv.c: In function ‘Perl_magic_freeovrld’:
perl.c: In function ‘S_init_main_stash’:
gv.c: In function ‘Perl_Gv_AMupdate’:
gv.c: In function ‘Perl_try_amagic_bin’:
gv.c:3032:13: warning: declaration of ‘left’ shadows a previous local [-Wshadow]
perl.c: In function ‘Perl_init_debugger’:
op.c: In function ‘S_fold_constants’:
op.c:5525:17: warning: declaration of ‘sv’ shadows a previous local [-Wshadow]
gv.c: In function ‘Perl_amagic_call’:
perl.c: In function ‘S_init_predump_symbols’:
op.c: In function ‘S_gen_constant_list’:
perl.h:1252:17: warning: declaration of ‘svp’ shadows a previous local [-Wshadow]
perl.c: In function ‘S_init_postdump_symbols’:
perl.c:4641:26: warning: declaration of ‘nlen’ shadows a previous local [-Wshadow]
op.c: In function ‘S_pmtrans’:
gv.c: In function ‘Perl_gv_try_downgrade’:
op.c: In function ‘Perl_pmruntime’:
op.c:6890:6: warning: declaration of ‘o’ shadows a parameter [-Wshadow]
toke.c: In function ‘S_scan_const’:
toke.c:3816:41: warning: declaration of ‘len’ shadows a previous local [-Wshadow]
perl.h:1521:52: warning: declaration of ‘len’ shadows a previous local [-Wshadow]
op.c:6918:6: warning: declaration of ‘o’ shadows a parameter [-Wshadow]
toke.c:3846:37: warning: declaration of ‘uv’ shadows a previous local [-Wshadow]
toke.c:3869:50: warning: declaration of ‘off’ shadows a previous local [-Wshadow]
toke.c:3870:41: warning: declaration of ‘uv’ shadows a previous local [-Wshadow]
op.c: In function ‘Perl_utilize’:
op.c:7433:10: warning: declaration of ‘pack’ shadows a previous local [-Wshadow]
op.c: In function ‘Perl_cv_const_sv’:
op.c: In function ‘Perl_cv_const_sv_or_av’:
op.c: In function ‘Perl_newMYSUB’:
op.c: In function ‘Perl_newATTRSUB_x’:
op.c: In function ‘S_clear_special_blocks’:
op.c: In function ‘S_process_special_blocks’:
op.c: In function ‘Perl_ck_spair’:
op.c:11244:19: warning: declaration of ‘type’ shadows a previous local [-Wshadow]
op.c: In function ‘Perl_ck_rvconst’:
toke.c: In function ‘Perl_yylex’:
toke.c:6737:36: warning: declaration of ‘len’ shadows a previous local [-Wshadow]
op.c: In function ‘Perl_ck_sort’:
op.c:12570:6: warning: declaration of ‘kid’ shadows a previous local [-Wshadow]
op.c: In function ‘Perl_rv2cv_op_cv’:
toke.c:7028:13: warning: declaration of ‘gv’ shadows a previous local [-Wshadow]
toke.c:7197:7: warning: declaration of ‘cv’ shadows a previous local [-Wshadow]
toke.c:7677:10: warning: declaration of ‘gv’ shadows a previous local [-Wshadow]
op.c: In function ‘Perl_wrap_op_checker’:
op.c:16913:35: warning: declaration of ‘opcode’ shadows a global declaration [-Wshadow]
op.c: In function ‘const_sv_xsub’:
toke.c:7875:29: warning: declaration of ‘off’ shadows a previous local [-Wshadow]
op.c: In function ‘const_av_xsub’:
toke.c:8259:25: warning: declaration of ‘len’ shadows a previous local [-Wshadow]
gv.c: In function ‘Perl_newGP’:
stadtx_hash.h:185:26: warning: inlining failed in call to ‘stadtx_hash_with_state.constprop’: --param max-inline-insns-single limit reached [-Winline]
toke.c:8394:8: warning: declaration of ‘sv’ shadows a previous local [-Wshadow]
toke.c:8666:25: warning: declaration of ‘off’ shadows a previous local [-Wshadow]
toke.c: In function ‘S_new_constant’:
toke.c: In function ‘S_parse_ident’:
toke.c:9350:15: warning: declaration of ‘d’ shadows a parameter [-Wshadow]
gv.c: In function ‘Perl_gv_name_set’:
toke.c: In function ‘Perl_start_subparse’:
toke.c: In function ‘Perl_yyerror_pvn’:
toke.c:11751:22: warning: declaration of ‘msg’ shadows a previous local [-Wshadow]
gv.c: In function ‘Perl_gv_fetchpvn_flags’:
gv.c:1609:1: warning: inlining failed in call to ‘S_parse_gv_stash_name’: --param large-function-growth limit reached [-Winline]
gv.c:1779:1: warning: inlining failed in call to ‘S_find_default_stash’: --param large-function-growth limit reached [-Winline]
gv.c: In function ‘Perl_gv_fetchmeth_pv’:
gv.c:702:1: warning: inlining failed in call to ‘S_gv_fetchmeth_internal’: --param max-inline-insns-single limit reached [-Winline]
gv.c: In function ‘Perl_gv_fetchmeth_pvn’:
gv.c: In function ‘Perl_gv_fetchmeth_sv’:
gv.c: In function ‘Perl_gv_fetchmeth_pvn_autoload’:
gv.c: In function ‘Perl_gv_autoload_pvn’:
gv.c: In function ‘Perl_gv_fetchmethod_pvn_flags’:
inline.h: In function ‘S_newSV_maybe_utf8’:
inline.h:938:1: warning: inlining failed in call to ‘Perl_is_utf8_string_loclen.constprop’: call is unlikely and code size would grow [-Winline]
pad.c: In function ‘Perl_cv_undef_flags’:
pad.c: In function ‘S_pad_alloc_name’:
pad.c: In function ‘Perl_pad_add_anon’:
pad.c: In function ‘S_pad_findlex’:
pad.c: In function ‘S_cv_clone_pad’:
pad.c: In function ‘Perl_pad_fixup_inner_anons’:
pad.c:2376:10: warning: declaration of ‘innercv’ shadows a previous local [-Wshadow]
pad.c: In function ‘Perl_pad_push’:
pad.c: In function ‘Perl_padlist_dup’:
regcomp.c: In function ‘S_get_ANYOF_cp_list_for_ssc’:
regcomp.c: In function ‘S_make_trie’:
regcomp.c:3353:49: warning: declaration of ‘tmp’ shadows a previous local [-Wshadow]
regcomp.c:3354:26: warning: declaration of ‘ch’ shadows a previous local [-Wshadow]
regcomp.c:3374:28: warning: declaration of ‘len’ shadows a previous local [-Wshadow]
regcomp.c: In function ‘S_study_chunk’:
regcomp.c:4487:34: warning: declaration of ‘last’ shadows a parameter [-Wshadow]
regcomp.c: In function ‘S_concat_pat’:
regcomp.c:6383:33: warning: declaration of ‘svp’ shadows a previous local [-Wshadow]
regcomp.c:6431:17: warning: declaration of ‘sv’ shadows a previous local [-Wshadow]
regcomp.c: In function ‘S_compile_runtime_code’:
cop.h:1045:26: warning: declaration of ‘p’ shadows a previous local [-Wshadow]
cop.h:1072:27: warning: declaration of ‘p’ shadows a previous local [-Wshadow]
regcomp.c: In function ‘Perl_re_op_compile’:
regcomp.c:7888:24: warning: declaration of ‘scan’ shadows a previous local [-Wshadow]
regcomp.h:1066:45: warning: declaration of ‘re_debug_flags’ shadows a previous local [-Wshadow]
regcomp.c: In function ‘Perl_reg_named_buff_scalar’:
regcomp.c: In function ‘S_reg’:
regcomp.c:8441:9: warning: declaration of ‘num’ shadows a previous local [-Wshadow]
regcomp.c:11269:18: warning: declaration of ‘num’ shadows a previous local [-Wshadow]
regcomp.c: In function ‘S_grok_bslash_N’:
regcomp.c:649:8: warning: declaration of ‘len’ shadows a previous local [-Wshadow]
regcomp.c: In function ‘S_regatom’:
regcomp.c:13572:12: warning: declaration of ‘flags’ shadows a previous local [-Wshadow]
regcomp.c:13598:12: warning: declaration of ‘len’ shadows a previous local [-Wshadow]
regcomp.c: In function ‘S_handle_regex_sets’:
regcomp.c:15269:34: warning: declaration of ‘save_parse’ shadows a previous local [-Wshadow]
regcomp.c:15481:25: warning: declaration of ‘lhs’ shadows a previous local [-Wshadow]
dump.c: In function ‘Perl_sv_peek’:
dump.c:389:13: warning: comparing floating point with == or != is unsafe [-Wfloat-equal]
dump.c:400:13: warning: comparing floating point with == or != is unsafe [-Wfloat-equal]
dump.c:411:13: warning: comparing floating point with == or != is unsafe [-Wfloat-equal]
perl.h:173:22: warning: declaration of ‘my_perl’ shadows a parameter [-Wshadow]
dump.c: In function ‘Perl_do_sv_dump’:
regcomp.c: In function ‘Perl__get_regclass_nonbitmap_data’:
regcomp.c: In function ‘Perl_regfree_internal’:
regcomp.c: In function ‘Perl_save_re_context’:
regcomp.c: In function ‘S_put_charclass_bitmap_innards’:
regcomp.c:20845:21: warning: declaration of ‘i’ shadows a previous local [-Wshadow]
regcomp.c: In function ‘S_dumpuntil’:
regcomp.c:21080:17: warning: declaration of ‘op’ shadows a previous local [-Wshadow]
op.c: In function ‘Perl_ck_require’:
sbox32_hash.h:1493:26: warning: inlining failed in call to ‘sbox32_hash_with_state.constprop’: --param max-inline-insns-single limit reached [-Winline]
regcomp.c: In function ‘S_is_ssc_worth_it’:
invlist_inline.h:60:1: warning: inlining failed in call to ‘S_invlist_array’: --param inline-unit-growth limit reached [-Winline]
util.c: In function ‘Perl_safesysmalloc’:
perl.h:173:22: warning: declaration of ‘my_perl’ shadows a previous local [-Wshadow]
util.c: In function ‘Perl_safesysrealloc’:
util.c: In function ‘Perl_safesysfree’:
util.c: In function ‘Perl_safesyscalloc’:
util.c: In function ‘Perl_fbm_compile’:
util.c:718:16: warning: declaration of ‘mg’ shadows a previous local [-Wshadow]
util.c: In function ‘S_invoke_exception_hook’:
util.c: In function ‘Perl_my_setenv’:
util.c:2101:27: warning: declaration of ‘len’ shadows a previous local [-Wshadow]
util.c: In function ‘Perl_my_popen_list’:
util.c:2315:11: warning: declaration of ‘n’ shadows a parameter [-Wshadow]
vutil.c: In function ‘Perl_new_version’:
vutil.c: In function ‘Perl_upg_version’:
vutil.c: In function ‘Perl_vnumify’:
vutil.c: In function ‘Perl_vnormal’:
vutil.c: In function ‘Perl_vcmp’:
util.c: In function ‘Perl_get_re_arg’:
regcomp.c: In function ‘Perl__invlist_intersection_maybe_complement_2nd’:
regcomp.c:9935:1: warning: inlining failed in call to ‘S_invlist_clone’: --param max-inline-insns-single limit reached [-Winline]
regcomp.c:8672:1: warning: inlining failed in call to ‘S_invlist_trim’: --param inline-unit-growth limit reached [-Winline]
regcomp.c: In function ‘S_ssc_finalize’:
regcomp.c: In function ‘Perl__invlist_union_maybe_complement_2nd’:
mg.c: In function ‘S_mg_free_struct’:
regcomp.c: In function ‘Perl__add_range_to_invlist’:
regcomp.c:8573:1: warning: inlining failed in call to ‘S_invlist_set_len.isra.10’: --param inline-unit-growth limit reached [-Winline]
mg.c: In function ‘Perl_magic_methcall’:
mg.c:1914:16: warning: declaration of ‘sv’ shadows a parameter [-Wshadow]
mg.c: In function ‘Perl_magic_setlvref’:
mg.c: In function ‘Perl_magic_set’:
mg.c:2848:13: warning: declaration of ‘len’ shadows a previous local [-Wshadow]
mg.c:2903:14: warning: declaration of ‘len’ shadows a previous local [-Wshadow]
mg.c:2903:19: warning: declaration of ‘i’ shadows a previous local [-Wshadow]
mg.c:2921:11: warning: declaration of ‘len’ shadows a previous local [-Wshadow]
mg.c: In function ‘Perl_sighandler’:
regcomp.c: In function ‘Perl_regprop’:
invlist_inline.h:33:1: warning: inlining failed in call to ‘S__invlist_len’: --param inline-unit-growth limit reached [-Winline]
regcomp.c:10608:1: warning: inlining failed in call to ‘S_handle_named_backref’: call is unlikely and code size would grow [-Winline]
mro_core.c: In function ‘S_mro_get_linear_isa_dfs’:
mro_core.c:334:12: warning: declaration of ‘svp’ shadows a previous local [-Wshadow]
mro_core.c: In function ‘Perl_mro_isa_changed_in’:
mro_core.c:600:28: warning: declaration of ‘isa’ shadows a previous local [-Wshadow]
mro_core.c: In function ‘Perl_mro_package_moved’:
mro_core.c:860:13: warning: declaration of ‘stash’ shadows a parameter [-Wshadow]
mro_core.c: In function ‘S_mro_gather_and_rename’:
mro_core.c:918:13: warning: declaration of ‘entry’ shadows a previous local [-Wshadow]
regcomp.c: In function ‘S_regclass’:
invlist_inline.h:48:1: warning: inlining failed in call to ‘S__invlist_contains_cp’: call is unlikely and code size would grow [-Winline]
invlist_inline.h:33:1: warning: inlining failed in call to ‘S__invlist_len’: call is unlikely and code size would grow [-Winline]
invlist_inline.h:60:1: warning: inlining failed in call to ‘S_invlist_array’: call is unlikely and code size would grow [-Winline]
dquote_inline.h:39:1: warning: inlining failed in call to ‘S_form_short_octal_warning’: call is unlikely and code size would grow [-Winline]
regcomp.c:12371:1: warning: inlining failed in call to ‘S_compute_EXACTish’: call is unlikely and code size would grow [-Winline]
regcomp.c:12393:1: warning: inlining failed in call to ‘S_alloc_maybe_populate_EXACT’: call is unlikely and code size would grow [-Winline]
regcomp.c:10029:1: warning: inlining failed in call to ‘S_invlist_highest’: --param inline-unit-growth limit reached [-Winline]
regcomp.c:9970:1: warning: inlining failed in call to ‘S_invlist_iterinit’: call is unlikely and code size would grow [-Winline]
regcomp.c:9978:1: warning: inlining failed in call to ‘S_invlist_iterfinish’: call is unlikely and code size would grow [-Winline]
regcomp.c:10029:1: warning: inlining failed in call to ‘S_invlist_highest’: call is unlikely and code size would grow [-Winline]

-- 
Report by Test::Smoke v1.53 build 1374 running on perl 5.24.1
(Reporter v0.050 / Smoker v0.045)



nntp.perl.org: Perl Programming lists via nntp and http.
Comments to Ask Bjørn Hansen at ask@perl.org | Group listing | About