develooper Front page | perl.daily-build.reports | Postings from February 2018

Smoke [smoke-me/khw-locale] v5.27.8-186-g5076b8a889 FAIL(F) freebsd11.1-RELEASE-p4 (amd64/1 cpu)

From:
Carlos Guevara
Date:
February 8, 2018 23:05
Subject:
Smoke [smoke-me/khw-locale] v5.27.8-186-g5076b8a889 FAIL(F) freebsd11.1-RELEASE-p4 (amd64/1 cpu)
Message ID:
201802082305.w18N5Gt8044950@cjg-freebsd11
Automated smoke report for branch smoke-me/khw-locale 5.27.9 patch 5076b8a889baa42872a7a0b71579dde8c95de14a v5.27.8-186-g5076b8a889
cjg-freebsd11: Intel(R) Xeon(R) CPU           E5420  @ 2.50GHz (amd64/1 cpu)
    on        freebsd - 11.1-RELEASE-p4
    using     cc version 4.2.1 Compatible FreeBSD Clang 4.0.0 (tags/RELEASE_400/final 297347)
    smoketime 6 hours 7 minutes (average 45 minutes 54 seconds)

Summary: FAIL(F)

O = OK  F = Failure(s), extended report at the bottom
X = Failure(s) under TEST but not under harness
? = still running or test results not (yet) available
Build failures during:       - = unknown or N/A
c = Configure, m = make, M = make (after miniperl), t = make test-prep

v5.27.8-186-g5076b8a889  Configuration (common) none
----------- ---------------------------------------------------------
F F         
F F         -Duse64bitall
F F         -Duseithreads
F F         -Duseithreads -Duse64bitall
| +--------- -DDEBUGGING
+----------- no debugging


Locally applied patches:
    SMOKE5076b8a889baa42872a7a0b71579dde8c95de14a

Testsuite was run only with 'harness'

Tests skipped on user request:
    # One test name on a line
Failures: (common-args) none
[default] 
[default] -DDEBUGGING
[default] -Duse64bitall
[default] -DDEBUGGING -Duse64bitall
../t/porting/globvar.t......................................FAILED
    1-2
../lib/warnings.t...........................................FAILED
    710, 712, 714, 901

[default] -Duseithreads
[default] -DDEBUGGING -Duseithreads
[default] -Duseithreads -Duse64bitall
[default] -DDEBUGGING -Duseithreads -Duse64bitall
../t/run/locale.t...........................................FAILED
    7-8, 10-23, 25, 28-29
../lib/warnings.t...........................................FAILED
    710, 712, 714, 901

Compiler messages(gcc):


Non-Fatal messages(gcc):



-- 
Report by Test::Smoke v1.71 running on perl 5.26.1
(Reporter v0.053 / Smoker v0.046)



nntp.perl.org: Perl Programming lists via nntp and http.
Comments to Ask Bjørn Hansen at ask@perl.org | Group listing | About