develooper Front page | perl.daily-build.reports | Postings from February 2018

Smoke [5.27.9] v5.27.8-237-g41715441c0 FAIL(X) linux4.14.13-mainline-rev1 [debian] (aarch64/4 cpu)

From:
kalidev2013
Date:
February 8, 2018 19:24
Subject:
Smoke [5.27.9] v5.27.8-237-g41715441c0 FAIL(X) linux4.14.13-mainline-rev1 [debian] (aarch64/4 cpu)
Message ID:
E1ejrnv-0002AO-Ej@scaleway.teada.net
Automated smoke report for 5.27.9 patch 41715441c03ba3cca251b6bba5fecee19073b7ae v5.27.8-237-g41715441c0
scaleway:  ( 0MHz) (aarch64/4 cpu)
    on        linux - 4.14.13-mainline-rev1 [debian]
    using      gcc-6 version 6.3.0 20170516
    smoketime 11 hours 48 minutes (average 1 hour 18 minutes)

Summary: FAIL(X)

O = OK  F = Failure(s), extended report at the bottom
X = Failure(s) under TEST but not under harness
? = still running or test results not (yet) available
Build failures during:       - = unknown or N/A
c = Configure, m = make, M = make (after miniperl), t = make test-prep

v5.27.8-237-g41715441c0  Configuration (common) -Acc=gcc-6
----------- ---------------------------------------------------------
X -         -Accflags="-O2" -Duseithreads
X -         -Accflags="-O2" -Duseithreads -Duse64bitint
X -         -Accflags="-O2" -Duseithreads -Duselongdouble
X -         -Accflags="-O2" -Duseithreads -Dusemorebits
X -         -Accflags="-O2 -Wall" -Duseithreads
X -         -Accflags="-O2 -Wall" -Duseithreads -Duse64bitint
X -         -Accflags="-O2 -Wall" -Duseithreads -Duselongdouble
X -         -Accflags="-O2 -Wall" -Duseithreads -Dusemorebits
- -         -Accflags="-O2 -W -Wformat=2 -Wswitch -Wshadow -Wwrite-strings -Wuninitialized -Wall -pipe -fomit-frame-pointer -D_FORTIFY_SOURCE=2 -Wpointer-arith -Wstrict-prototypes -fstack-protector -Wstack-protector -Wextra -Wbad-function-cast -Wcast-align -Wdisabled-optimization -Wendif-labels -Wfloat-equal -Wformat-nonliteral -Winline -Wmissing-declarations -Wmissing-prototypes -Wnested-externs -Wpointer-arith -Wundef -Wformat-security -march=armv8-a+crc" -Duseithreads
| +--------- -DDEBUGGING
+----------- no debugging


Locally applied patches:
    SMOKE41715441c03ba3cca251b6bba5fecee19073b7ae

Failures: (common-args) -Acc=gcc-6
[default] -Accflags="-O2" -Duseithreads
[default] -Accflags="-O2" -Duseithreads -Duse64bitint
[default] -Accflags="-O2 -Wall" -Duseithreads
[default] -Accflags="-O2 -Wall" -Duseithreads -Duse64bitint
Inconsistent test results (between TEST and harness):
    ../ext/I18N-Langinfo/t/Langinfo.t....... ................................... FAILED--non-zero wait status: 11

[default] -Accflags="-O2" -Duseithreads -Duselongdouble
[default] -Accflags="-O2 -Wall" -Duseithreads -Duselongdouble
Inconsistent test results (between TEST and harness):
    ../lib/File/Copy.t...................... .................................................. FAILED at test 53
    ../ext/I18N-Langinfo/t/Langinfo.t....... ................................... FAILED--non-zero wait status: 11

[default] -Accflags="-O2" -Duseithreads -Dusemorebits
[default] -Accflags="-O2 -Wall" -Duseithreads -Dusemorebits
Inconsistent test results (between TEST and harness):
    ../ext/I18N-Langinfo/t/Langinfo.t....... ................................... FAILED--non-zero wait status: 11
    ../lib/File/Copy.t...................... .................................................. FAILED at test 53

Compiler messages(gcc):
make ...ODBM_File.c: In function ‘XS_ODBM_File_DELETE’:
ODBM_File.xs:64:31: warning: identifier ‘delete’ conflicts with C++ keyword [-Wc++-compat]
Configure ...try.c: In function ‘main’:
try.c: In function ‘main’:
try.c: In function ‘blech’:
try.c: In function ‘blech_in_list’:
try.c: In function ‘bletch’:
signal.c:8:5: warning: function declaration isn’t a prototype [-Wstrict-prototypes]
perl.h:1296:5: warning: "VMS" is not defined [-Wundef]
inline.h: In function ‘S_cx_popsub_args’:
handy.h:57:35: warning: declaration of ‘_p’ shadows a previous local [-Wshadow]
perl.c: In function ‘perl_destruct’:
perl.c:655:17: warning: declaration of ‘i’ shadows a previous local [-Wshadow]
cop.h:115:10: warning: declaration of ‘i’ shadows a previous local [-Wshadow]
cop.h:132:10: warning: declaration of ‘i’ shadows a previous local [-Wshadow]
perl.c:962:6: warning: declaration of ‘i’ shadows a previous local [-Wshadow]
perl.c:999:6: warning: declaration of ‘i’ shadows a previous local [-Wshadow]
perl.c:1362:13: warning: declaration of ‘i’ shadows a previous local [-Wshadow]
gv.c: In function ‘S_gv_fetchmeth_internal’:
gv.c:810:29: warning: declaration of ‘hvname’ shadows a previous local [-Wshadow]
toke.c: In function ‘Perl_lex_start’:
perl.c: In function ‘Perl_require_pv’:
pp.h:81:19: warning: declaration of ‘sp’ shadows a previous local [-Wshadow]
perl.c: In function ‘S_init_main_stash’:
perl.c: In function ‘Perl_init_debugger’:
toke.c: In function ‘S_incline’:
gv.c: In function ‘S_require_tie_mod’:
perl.c: In function ‘S_init_predump_symbols’:
perl.c: In function ‘S_init_postdump_symbols’:
perl.c:4641:26: warning: declaration of ‘nlen’ shadows a previous local [-Wshadow]
gv.c: In function ‘S_parse_gv_stash_name’:
op.c: In function ‘Perl_scalarvoid’:
op.c:2090:61: warning: comparing floating point with == or != is unsafe [-Wfloat-equal]
op.c:2090:74: warning: comparing floating point with == or != is unsafe [-Wfloat-equal]
toke.c: In function ‘S_scan_const’:
toke.c:3816:41: warning: declaration of ‘len’ shadows a previous local [-Wshadow]
perl.h:1521:52: warning: declaration of ‘len’ shadows a previous local [-Wshadow]
toke.c:3846:37: warning: declaration of ‘uv’ shadows a previous local [-Wshadow]
toke.c:3869:50: warning: declaration of ‘off’ shadows a previous local [-Wshadow]
toke.c:3870:41: warning: declaration of ‘uv’ shadows a previous local [-Wshadow]
gv.c: In function ‘Perl_magic_freeovrld’:
op.c: In function ‘S_maybe_multiconcat’:
op.c:3070:19: warning: declaration of ‘p’ shadows a previous local [-Wshadow]
op.c:3274:28: warning: declaration of ‘p’ shadows a previous local [-Wshadow]
op.c: In function ‘Perl_op_lvalue_flags’:
op.c:3960:7: warning: declaration of ‘kid’ shadows a previous local [-Wshadow]
gv.c: In function ‘Perl_Gv_AMupdate’:
gv.c: In function ‘Perl_try_amagic_bin’:
gv.c:3032:13: warning: declaration of ‘left’ shadows a previous local [-Wshadow]
op.c: In function ‘S_fold_constants’:
op.c:5525:17: warning: declaration of ‘sv’ shadows a previous local [-Wshadow]
op.c: In function ‘S_gen_constant_list’:
perl.h:1252:17: warning: declaration of ‘svp’ shadows a previous local [-Wshadow]
gv.c: In function ‘Perl_amagic_call’:
op.c: In function ‘S_pmtrans’:
op.c: In function ‘Perl_pmruntime’:
op.c:6890:6: warning: declaration of ‘o’ shadows a parameter [-Wshadow]
op.c:6918:6: warning: declaration of ‘o’ shadows a parameter [-Wshadow]
op.c: In function ‘Perl_utilize’:
op.c:7433:10: warning: declaration of ‘pack’ shadows a previous local [-Wshadow]
op.c: In function ‘Perl_cv_const_sv’:
op.c: In function ‘Perl_cv_const_sv_or_av’:
op.c: In function ‘Perl_newMYSUB’:
gv.c: In function ‘Perl_gv_try_downgrade’:
op.c: In function ‘Perl_newATTRSUB_x’:
op.c: In function ‘S_clear_special_blocks’:
op.c: In function ‘S_process_special_blocks’:
toke.c: In function ‘Perl_yylex’:
toke.c:6737:36: warning: declaration of ‘len’ shadows a previous local [-Wshadow]
toke.c:7028:13: warning: declaration of ‘gv’ shadows a previous local [-Wshadow]
toke.c:7197:7: warning: declaration of ‘cv’ shadows a previous local [-Wshadow]
op.c: In function ‘Perl_ck_spair’:
op.c:11244:19: warning: declaration of ‘type’ shadows a previous local [-Wshadow]
toke.c:7677:10: warning: declaration of ‘gv’ shadows a previous local [-Wshadow]
op.c: In function ‘Perl_ck_rvconst’:
toke.c:7875:29: warning: declaration of ‘off’ shadows a previous local [-Wshadow]
op.c: In function ‘Perl_ck_sort’:
op.c:12570:6: warning: declaration of ‘kid’ shadows a previous local [-Wshadow]
op.c: In function ‘Perl_rv2cv_op_cv’:
toke.c:8259:25: warning: declaration of ‘len’ shadows a previous local [-Wshadow]
op.c: In function ‘Perl_wrap_op_checker’:
op.c:16913:35: warning: declaration of ‘opcode’ shadows a global declaration [-Wshadow]
op.c: In function ‘const_sv_xsub’:
op.c: In function ‘const_av_xsub’:
toke.c:8394:8: warning: declaration of ‘sv’ shadows a previous local [-Wshadow]
toke.c:8666:25: warning: declaration of ‘off’ shadows a previous local [-Wshadow]
toke.c: In function ‘S_new_constant’:
toke.c: In function ‘S_parse_ident’:
toke.c:9350:15: warning: declaration of ‘d’ shadows a parameter [-Wshadow]
gv.c: In function ‘Perl_newGP’:
stadtx_hash.h:185:26: warning: inlining failed in call to ‘stadtx_hash_with_state.constprop’: --param max-inline-insns-single limit reached [-Winline]
gv.c: In function ‘Perl_gv_name_set’:
toke.c: In function ‘Perl_start_subparse’:
toke.c: In function ‘Perl_yyerror_pvn’:
toke.c:11751:22: warning: declaration of ‘msg’ shadows a previous local [-Wshadow]
gv.c: In function ‘Perl_gv_fetchpvn_flags’:
gv.c:1609:1: warning: inlining failed in call to ‘S_parse_gv_stash_name’: --param large-function-growth limit reached [-Winline]
gv.c:1779:1: warning: inlining failed in call to ‘S_find_default_stash’: --param large-function-growth limit reached [-Winline]
gv.c: In function ‘Perl_gv_fetchmeth_pv’:
gv.c:702:1: warning: inlining failed in call to ‘S_gv_fetchmeth_internal’: --param max-inline-insns-single limit reached [-Winline]
gv.c: In function ‘Perl_gv_fetchmeth_pvn’:
gv.c: In function ‘Perl_gv_fetchmeth_sv’:
gv.c: In function ‘Perl_gv_fetchmeth_pvn_autoload’:
gv.c: In function ‘Perl_gv_autoload_pvn’:
gv.c: In function ‘Perl_gv_fetchmethod_pvn_flags’:
pad.c: In function ‘Perl_cv_undef_flags’:
pad.c: In function ‘S_pad_alloc_name’:
pad.c: In function ‘Perl_pad_add_anon’:
pad.c: In function ‘S_pad_findlex’:
pad.c: In function ‘S_cv_clone_pad’:
pad.c: In function ‘Perl_pad_fixup_inner_anons’:
pad.c:2376:10: warning: declaration of ‘innercv’ shadows a previous local [-Wshadow]
pad.c: In function ‘Perl_pad_push’:
pad.c: In function ‘Perl_padlist_dup’:
inline.h: In function ‘S_newSV_maybe_utf8’:
inline.h:938:1: warning: inlining failed in call to ‘Perl_is_utf8_string_loclen.constprop’: call is unlikely and code size would grow [-Winline]
regcomp.c: In function ‘S_get_ANYOF_cp_list_for_ssc’:
regcomp.c: In function ‘S_make_trie’:
regcomp.c:3353:49: warning: declaration of ‘tmp’ shadows a previous local [-Wshadow]
regcomp.c:3354:26: warning: declaration of ‘ch’ shadows a previous local [-Wshadow]
regcomp.c:3374:28: warning: declaration of ‘len’ shadows a previous local [-Wshadow]
regcomp.c: In function ‘S_study_chunk’:
regcomp.c:4487:34: warning: declaration of ‘last’ shadows a parameter [-Wshadow]
regcomp.c: In function ‘S_concat_pat’:
regcomp.c:6383:33: warning: declaration of ‘svp’ shadows a previous local [-Wshadow]
dump.c: In function ‘Perl_sv_peek’:
dump.c:389:13: warning: comparing floating point with == or != is unsafe [-Wfloat-equal]
dump.c:400:13: warning: comparing floating point with == or != is unsafe [-Wfloat-equal]
dump.c:411:13: warning: comparing floating point with == or != is unsafe [-Wfloat-equal]
regcomp.c:6431:17: warning: declaration of ‘sv’ shadows a previous local [-Wshadow]
perl.h:173:22: warning: declaration of ‘my_perl’ shadows a parameter [-Wshadow]
regcomp.c: In function ‘S_compile_runtime_code’:
cop.h:1045:26: warning: declaration of ‘p’ shadows a previous local [-Wshadow]
cop.h:1072:27: warning: declaration of ‘p’ shadows a previous local [-Wshadow]
dump.c: In function ‘Perl_do_sv_dump’:
regcomp.c: In function ‘Perl_re_op_compile’:
regcomp.c:7888:24: warning: declaration of ‘scan’ shadows a previous local [-Wshadow]
regcomp.h:1066:45: warning: declaration of ‘re_debug_flags’ shadows a previous local [-Wshadow]
regcomp.c: In function ‘Perl_reg_named_buff_scalar’:
regcomp.c: In function ‘S_reg’:
regcomp.c:8441:9: warning: declaration of ‘num’ shadows a previous local [-Wshadow]
regcomp.c:11269:18: warning: declaration of ‘num’ shadows a previous local [-Wshadow]
regcomp.c: In function ‘S_grok_bslash_N’:
regcomp.c:649:8: warning: declaration of ‘len’ shadows a previous local [-Wshadow]
regcomp.c: In function ‘S_regatom’:
regcomp.c:13572:12: warning: declaration of ‘flags’ shadows a previous local [-Wshadow]
regcomp.c:13598:12: warning: declaration of ‘len’ shadows a previous local [-Wshadow]
regcomp.c: In function ‘S_handle_regex_sets’:
regcomp.c:15269:34: warning: declaration of ‘save_parse’ shadows a previous local [-Wshadow]
regcomp.c:15481:25: warning: declaration of ‘lhs’ shadows a previous local [-Wshadow]
regcomp.c: In function ‘Perl__get_regclass_nonbitmap_data’:
regcomp.c: In function ‘Perl_regfree_internal’:
regcomp.c: In function ‘Perl_save_re_context’:
regcomp.c: In function ‘S_put_charclass_bitmap_innards’:
regcomp.c:20845:21: warning: declaration of ‘i’ shadows a previous local [-Wshadow]
regcomp.c: In function ‘S_dumpuntil’:
regcomp.c:21080:17: warning: declaration of ‘op’ shadows a previous local [-Wshadow]
op.c: In function ‘Perl_ck_require’:
sbox32_hash.h:1493:26: warning: inlining failed in call to ‘sbox32_hash_with_state.constprop’: --param max-inline-insns-single limit reached [-Winline]
util.c: In function ‘Perl_safesysmalloc’:
perl.h:173:22: warning: declaration of ‘my_perl’ shadows a previous local [-Wshadow]
util.c: In function ‘Perl_safesysrealloc’:
util.c: In function ‘Perl_safesysfree’:
util.c: In function ‘Perl_safesyscalloc’:
util.c: In function ‘Perl_fbm_compile’:
util.c:718:16: warning: declaration of ‘mg’ shadows a previous local [-Wshadow]
util.c: In function ‘S_invoke_exception_hook’:
util.c: In function ‘Perl_my_setenv’:
util.c:2101:27: warning: declaration of ‘len’ shadows a previous local [-Wshadow]
util.c: In function ‘Perl_my_popen_list’:
util.c:2315:11: warning: declaration of ‘n’ shadows a parameter [-Wshadow]
vutil.c: In function ‘Perl_new_version’:
vutil.c: In function ‘Perl_upg_version’:
vutil.c: In function ‘Perl_vnumify’:
vutil.c: In function ‘Perl_vnormal’:
vutil.c: In function ‘Perl_vcmp’:
util.c: In function ‘Perl_get_re_arg’:
regcomp.c: In function ‘S_is_ssc_worth_it’:
invlist_inline.h:60:1: warning: inlining failed in call to ‘S_invlist_array’: --param inline-unit-growth limit reached [-Winline]
regcomp.c: In function ‘Perl__invlist_intersection_maybe_complement_2nd’:
regcomp.c:9935:1: warning: inlining failed in call to ‘S_invlist_clone’: --param max-inline-insns-single limit reached [-Winline]
regcomp.c:8672:1: warning: inlining failed in call to ‘S_invlist_trim’: --param inline-unit-growth limit reached [-Winline]
regcomp.c: In function ‘S_ssc_finalize’:
regcomp.c: In function ‘Perl__invlist_union_maybe_complement_2nd’:
mg.c: In function ‘S_mg_free_struct’:
mg.c: In function ‘Perl_magic_methcall’:
mg.c:1914:16: warning: declaration of ‘sv’ shadows a parameter [-Wshadow]
mg.c: In function ‘Perl_magic_setlvref’:
mg.c: In function ‘Perl_magic_set’:
mg.c:2848:13: warning: declaration of ‘len’ shadows a previous local [-Wshadow]
mg.c:2903:14: warning: declaration of ‘len’ shadows a previous local [-Wshadow]
mg.c:2903:19: warning: declaration of ‘i’ shadows a previous local [-Wshadow]
mg.c:2921:11: warning: declaration of ‘len’ shadows a previous local [-Wshadow]
regcomp.c: In function ‘Perl__add_range_to_invlist’:
regcomp.c:8573:1: warning: inlining failed in call to ‘S_invlist_set_len.isra.10’: --param inline-unit-growth limit reached [-Winline]
mg.c: In function ‘Perl_sighandler’:
regcomp.c: In function ‘Perl_regprop’:
invlist_inline.h:33:1: warning: inlining failed in call to ‘S__invlist_len’: --param inline-unit-growth limit reached [-Winline]
mro_core.c: In function ‘S_mro_get_linear_isa_dfs’:
mro_core.c:334:12: warning: declaration of ‘svp’ shadows a previous local [-Wshadow]
mro_core.c: In function ‘Perl_mro_isa_changed_in’:
mro_core.c:600:28: warning: declaration of ‘isa’ shadows a previous local [-Wshadow]
mro_core.c: In function ‘Perl_mro_package_moved’:
mro_core.c:860:13: warning: declaration of ‘stash’ shadows a parameter [-Wshadow]
mro_core.c: In function ‘S_mro_gather_and_rename’:
mro_core.c:918:13: warning: declaration of ‘entry’ shadows a previous local [-Wshadow]
regcomp.c:10608:1: warning: inlining failed in call to ‘S_handle_named_backref’: call is unlikely and code size would grow [-Winline]
regcomp.c: In function ‘S_regclass’:
invlist_inline.h:48:1: warning: inlining failed in call to ‘S__invlist_contains_cp’: call is unlikely and code size would grow [-Winline]
invlist_inline.h:33:1: warning: inlining failed in call to ‘S__invlist_len’: call is unlikely and code size would grow [-Winline]
invlist_inline.h:60:1: warning: inlining failed in call to ‘S_invlist_array’: call is unlikely and code size would grow [-Winline]
dquote_inline.h:39:1: warning: inlining failed in call to ‘S_form_short_octal_warning’: call is unlikely and code size would grow [-Winline]
regcomp.c:12371:1: warning: inlining failed in call to ‘S_compute_EXACTish’: call is unlikely and code size would grow [-Winline]
regcomp.c:12393:1: warning: inlining failed in call to ‘S_alloc_maybe_populate_EXACT’: call is unlikely and code size would grow [-Winline]
regcomp.c:10029:1: warning: inlining failed in call to ‘S_invlist_highest’: --param inline-unit-growth limit reached [-Winline]
regcomp.c:9970:1: warning: inlining failed in call to ‘S_invlist_iterinit’: call is unlikely and code size would grow [-Winline]
regcomp.c:9978:1: warning: inlining failed in call to ‘S_invlist_iterfinish’: call is unlikely and code size would grow [-Winline]
regcomp.c:10029:1: warning: inlining failed in call to ‘S_invlist_highest’: call is unlikely and code size would grow [-Winline]
hv.c: In function ‘Perl_he_dup’:
hv.c:172:7: warning: declaration of ‘shared’ shadows a parameter [-Wshadow]
hv.c: In function ‘S_hv_delete_common’:
hv.c:1126:10: warning: declaration of ‘sv’ shadows a previous local [-Wshadow]
hv.c: In function ‘Perl_hv_name_set’:
hv.c:2397:16: warning: declaration of ‘name’ shadows a parameter [-Wshadow]
hv.c: In function ‘Perl_refcounted_he_fetch_pvn’:
hv.c:3399:18: warning: declaration of ‘p’ shadows a previous local [-Wshadow]
hv.c:3399:30: warning: declaration of ‘keyend’ shadows a previous local [-Wshadow]
hv.c: In function ‘Perl_refcounted_he_new_pvn’:
hv.c:3575:18: warning: declaration of ‘p’ shadows a previous local [-Wshadow]
hv.c:3575:30: warning: declaration of ‘keyend’ shadows a previous local [-Wshadow]
av.c: In function ‘Perl_av_unshift’:
av.c:738:16: warning: declaration of ‘i’ shadows a previous local [-Wshadow]
hv.c: In function ‘Perl_share_hek’:
hv.c: In function ‘Perl_hv_ename_add’:
hv.c: In function ‘Perl_hv_common’:
regcomp.c:12393:1: warning: inlining failed in call to ‘S_alloc_maybe_populate_EXACT’: --param inline-unit-growth limit reached [-Winline]
pp_hot.c: In function ‘Perl_pp_sassign’:
pp_hot.c: In function ‘Perl_pp_multiconcat’:
pp_hot.c:1056:32: warning: declaration of ‘res’ shadows a previous local [-Wshadow]
pp_hot.c: In function ‘Perl_pp_readline’:
pp_hot.c: In function ‘Perl_pp_add’:
pp_hot.c:1477:20: warning: comparing floating point with == or != is unsafe [-Wfloat-equal]
pp_hot.c:1477:47: warning: comparing floating point with == or != is unsafe [-Wfloat-equal]
pp_hot.c: In function ‘Perl_pp_print’:
gv.h:31:19: warning: declaration of ‘_gvgp’ shadows a previous local [-Wshadow]
pp_hot.c: In function ‘Perl_pp_padav’:
pp_hot.c: In function ‘Perl_pp_aassign’:
pp_hot.c:2461:26: warning: declaration of ‘svp’ shadows a previous local [-Wshadow]
pp_hot.c:2627:22: warning: declaration of ‘svp’ shadows a previous local [-Wshadow]
pp_hot.c:2668:22: warning: declaration of ‘svp’ shadows a previous local [-Wshadow]
pp_hot.c: In function ‘Perl_pp_match’:
pp_hot.c:3101:13: warning: declaration of ‘len’ shadows a previous local [-Wshadow]
pp_hot.c:3102:22: warning: declaration of ‘s’ shadows a previous local [-Wshadow]
pp_hot.c: In function ‘Perl_pp_helem’:
pp_hot.c: In function ‘Perl_pp_multideref’:
pp_hot.c: In function ‘Perl_pp_iter’:
pp.h:304:21: warning: declaration of ‘ix’ shadows a previous local [-Wshadow]
pp_hot.c: In function ‘Perl_leave_adjust_stacks’:
pp_hot.c: In function ‘Perl_pp_entersub’:
pp_hot.c:5119:21: warning: declaration of ‘sv’ shadows a previous local [-Wshadow]
pp_hot.c:5210:11: warning: declaration of ‘sv’ shadows a previous local [-Wshadow]
pp_hot.c: In function ‘Perl_pp_aelem’:
pp_hot.c: In function ‘Perl_vivify_ref’:
pp_hot.c: In function ‘S_opmethod_stash’:
sv.c: In function ‘Perl_more_bodies’:
sv.c: In function ‘Perl_sv_upgrade’:
sv.c: In function ‘S_sv_2iuv_non_preserve’:
sv.c:2067:29: warning: comparing floating point with == or != is unsafe [-Wfloat-equal]
sv.c:2076:25: warning: comparing floating point with == or != is unsafe [-Wfloat-equal]
sv.c: In function ‘S_sv_2iuv_common’:
sv.c:2158:20: warning: comparing floating point with == or != is unsafe [-Wfloat-equal]
sv.c:2202:14: warning: comparing floating point with == or != is unsafe [-Wfloat-equal]
sv.c:2375:41: warning: comparing floating point with == or != is unsafe [-Wfloat-equal]
sv.c: In function ‘Perl_sv_2nv_flags’:
sv.c: In function ‘Perl_sv_2pv_flags’:
sv.c:3103:16: warning: comparing floating point with == or != is unsafe [-Wfloat-equal]
sv.c: In function ‘Perl_sv_2bool_flags’:
sv.c:3358:52: warning: comparing floating point with == or != is unsafe [-Wfloat-equal]
sv.c:3375:26: warning: comparing floating point with == or != is unsafe [-Wfloat-equal]
sv.c: In function ‘S_glob_assign_glob’:
sv.c: In function ‘Perl_sv_setsv_flags’:
sv.c:4185:13: warning: declaration of ‘sflags’ shadows a previous local [-Wshadow]
sv.c: In function ‘S_sv_unmagicext_flags’:
sv.c: In function ‘S_anonymise_cv_maybe’:
sv.c: In function ‘S_curse’:
sv.c: In function ‘Perl_sv_gets’:
perl.h:1688:26: warning: cast from function call of type ‘char *’ to non-matching type ‘long unsigned int’ [-Wbad-function-cast]
sv.c: In function ‘Perl_sv_inc_nomg’:
sv.c:8912:38: warning: comparing floating point with == or != is unsafe [-Wfloat-equal]
sv.c: In function ‘Perl_sv_dec_nomg’:
sv.c:9095:42: warning: comparing floating point with == or != is unsafe [-Wfloat-equal]
sv.c: In function ‘Perl_sv_true’:
sv.c:9981:20: warning: comparing floating point with == or != is unsafe [-Wfloat-equal]
sv.c: In function ‘Perl_newSVrv’:
sv.c: In function ‘Perl_sv_bless’:
sv.c:10956:1: warning: function declaration isn’t a prototype [-Wstrict-prototypes]
sv.c: In function ‘S_F0convert’:
sv.c:11062:12: warning: comparing floating point with == or != is unsafe [-Wfloat-equal]
sv.c:11065:9: warning: comparing floating point with == or != is unsafe [-Wfloat-equal]
sv.c:11068:23: warning: comparing floating point with == or != is unsafe [-Wfloat-equal]
sv.c: In function ‘S_hextract’:
sv.c:11233:36: warning: comparing floating point with == or != is unsafe [-Wfloat-equal]
sv.c: In function ‘S_format_hexfp’:
sv.c:11595:16: warning: comparing floating point with == or != is unsafe [-Wfloat-equal]
sv.c: In function ‘Perl_sv_vcatpvfn_flags’:
sv.c:12095:21: warning: declaration of ‘sv’ shadows a parameter [-Wshadow]
sv.c:12150:25: warning: declaration of ‘sv’ shadows a parameter [-Wshadow]
sv.c: In function ‘Perl_mg_dup’:
sv.c: In function ‘S_sv_dup_common’:
sv.c: In function ‘Perl_ss_dup’:
perl.h:1708:20: warning: cast from function call of type ‘void *’ to non-matching type ‘long unsigned int’ [-Wbad-function-cast]
sv.c: In function ‘Perl_sv_recode_to_utf8’:
sv.c: In function ‘S_find_uninit_var’:
sv.c:16808:13: warning: declaration of ‘gv’ shadows a previous local [-Wshadow]
regcomp.c: In function ‘S_study_chunk.constprop’:
regcomp.c:1866:1: warning: inlining failed in call to ‘S_ssc_add_range’: call is unlikely and code size would grow [-Winline]
regcomp.c:1838:1: warning: inlining failed in call to ‘S_ssc_union’: call is unlikely and code size would grow [-Winline]
regcomp.c:1851:1: warning: inlining failed in call to ‘S_ssc_intersection’: call is unlikely and code size would grow [-Winline]
pp.c: In function ‘Perl_pp_av2arylen’:
pp.c: In function ‘Perl_pp_rv2cv’:
pp.c: In function ‘Perl_pp_anoncode’:
pp.c: In function ‘Perl_pp_multiply’:
pp.c:1276:20: warning: comparing floating point with == or != is unsafe [-Wfloat-equal]
pp.c:1276:47: warning: comparing floating point with == or != is unsafe [-Wfloat-equal]
pp.c: In function ‘Perl_pp_divide’:
pp.c:1531:12: warning: comparing floating point with == or != is unsafe [-Wfloat-equal]
pp.c: In function ‘Perl_pp_modulo’:
pp.c:1631:10: warning: comparing floating point with == or != is unsafe [-Wfloat-equal]
pp.c:1635:34: warning: comparing floating point with == or != is unsafe [-Wfloat-equal]
pp.c: In function ‘Perl_pp_repeat’:
pp.h:491:21: warning: declaration of ‘sv’ shadows a previous local [-Wshadow]
pp.c: In function ‘Perl_pp_subtract’:
pp.c:1851:20: warning: comparing floating point with == or != is unsafe [-Wfloat-equal]
pp.c:1851:47: warning: comparing floating point with == or != is unsafe [-Wfloat-equal]
pp.c: In function ‘Perl_do_ncmp’:
pp.c:2191:15: warning: comparing floating point with == or != is unsafe [-Wfloat-equal]
pp.c: In function ‘Perl_pp_rand’:
pp.c:2907:12: warning: comparing floating point with == or != is unsafe [-Wfloat-equal]
pp.c: In function ‘Perl_pp_aslice’:
pp.c: In function ‘S_do_delete_local’:
pp.c: In function ‘Perl_pp_hslice’:
pp.c: In function ‘Perl_pp_reverse’:
pp.c: In function ‘Perl_pp_refassign’:
pp.c: In function ‘Perl_pp_lvref’:
pp.c:6519:16: warning: declaration of ‘mg’ shadows a previous local [-Wshadow]
pp.c: In function ‘Perl_pp_lvrefslice’:
pp.c: In function ‘Perl_pp_argelem’:
pp.c:6703:17: warning: declaration of ‘val’ shadows a previous local [-Wshadow]
pp.c:6739:17: warning: declaration of ‘val’ shadows a previous local [-Wshadow]
pp.c: In function ‘Perl_pp_argdefelem’:
pp_hot.c: In function ‘Perl_pp_method_named’:
pp_hot.c:5428:1: warning: inlining failed in call to ‘S_opmethod_stash’: --param max-inline-insns-single limit reached [-Winline]
pp_hot.c: In function ‘Perl_pp_method_super’:
pp_hot.c: In function ‘Perl_pp_method_redir’:
pp_hot.c: In function ‘Perl_pp_method_redir_super’:
scope.c: In function ‘Perl_leave_scope’:
pp_ctl.c: In function ‘Perl_pp_formline’:
pp_ctl.c:853:21: warning: declaration of ‘len’ shadows a previous local [-Wshadow]
pp_ctl.c: In function ‘Perl_pp_mapwhile’:
pp_ctl.c:1105:6: warning: declaration of ‘src’ shadows a previous local [-Wshadow]
pp_ctl.c: In function ‘Perl_die_unwind’:
pp_ctl.c: In function ‘Perl_pp_caller’:
pp_ctl.c: In function ‘Perl_pp_goto’:
pp_ctl.c:2774:20: warning: declaration of ‘cx’ shadows a previous local [-Wshadow]
pp_ctl.c:2895:8: warning: declaration of ‘sv’ shadows a previous local [-Wshadow]
pp_ctl.c: In function ‘S_doeval_compile’:
pp_ctl.c: In function ‘S_require_version’:
pp_ctl.c: In function ‘S_require_file’:
pp_ctl.c:3988:8: warning: declaration of ‘i’ shadows a previous local [-Wshadow]
perl.h:1243:31: warning: declaration of ‘saved_errno’ shadows a previous local [-Wshadow]
pp_ctl.c: In function ‘Perl_pp_hintseval’:
pp_ctl.c: In function ‘Perl_pp_entereval’:
pp_ctl.c:4395:9: warning: declaration of ‘len’ shadows a previous local [-Wshadow]
pp_ctl.c:4406:9: warning: declaration of ‘len’ shadows a previous local [-Wshadow]
pp_ctl.c: In function ‘S_do_smartmatch’:
pp_sys.c: In function ‘Perl_pp_glob’:
pp_sys.c: In function ‘Perl_tied_method’:
pp.h:81:19: warning: declaration of ‘sp’ shadows a parameter [-Wshadow]
pp_sys.c: In function ‘Perl_pp_tie’:
pp_sys.c: In function ‘Perl_pp_sselect’:
pp_sys.c:1150:13: warning: declaration of ‘sv’ shadows a previous local [-Wshadow]
pp_sys.c: In function ‘S_doform’:
pp_sys.c: In function ‘Perl_pp_truncate’:
pp_sys.c: In function ‘Perl_pp_stat’:
pp_sys.c: In function ‘Perl_pp_system’:
pp_sys.c:4531:14: warning: cast from function call of type ‘_Bool’ to non-matching type ‘int’ [-Wbad-function-cast]
pp_sys.c:4534:14: warning: cast from function call of type ‘_Bool’ to non-matching type ‘int’ [-Wbad-function-cast]
pp_sys.c:4536:14: warning: cast from function call of type ‘_Bool’ to non-matching type ‘int’ [-Wbad-function-cast]
pp_sys.c: In function ‘Perl_pp_exec’:
pp_sys.c:4591:10: warning: cast from function call of type ‘_Bool’ to non-matching type ‘int’ [-Wbad-function-cast]
pp_sys.c:4597:10: warning: cast from function call of type ‘_Bool’ to non-matching type ‘int’ [-Wbad-function-cast]
pp_sys.c:4603:10: warning: cast from function call of type ‘_Bool’ to non-matching type ‘int’ [-Wbad-function-cast]
pp_sys.c: In function ‘Perl_pp_gmtime’:
pp_sys.c:4789:32: warning: comparing floating point with == or != is unsafe [-Wfloat-equal]
inline.h:18:1: warning: inlining failed in call to ‘S_av_top_index’: call is unlikely and code size would grow [-Winline]
doop.c: In function ‘S_do_trans_complex’:
doop.c:229:10: warning: declaration of ‘len’ shadows a previous local [-Wshadow]
doop.c: In function ‘S_do_trans_simple_utf8’:
doop.c: In function ‘S_do_trans_count_utf8’:
doop.c: In function ‘S_do_trans_complex_utf8’:
doop.c:541:14: warning: declaration of ‘len’ shadows a previous local [-Wshadow]
doop.c: In function ‘Perl_do_join’:
doop.c:693:13: warning: declaration of ‘len’ shadows a previous local [-Wshadow]
doop.c:704:13: warning: declaration of ‘len’ shadows a previous local [-Wshadow]
doio.c: In function ‘Perl_nextargv’:
doio.c:1270:20: warning: declaration of ‘io’ shadows a previous local [-Wshadow]
doio.c: In function ‘Perl_my_stat_flags’:
regexec.c: In function ‘Perl_re_intuit_start’:
regexec.c:1062:17: warning: declaration of ‘sv’ shadows a parameter [-Wshadow]
utf8.c: In function ‘Perl_uvoffuni_to_utf8_flags_msgs’:
utf8.c:292:17: warning: format not a string literal, argument types not checked [-Wformat-nonliteral]
utf8.c:295:17: warning: format not a string literal, argument types not checked [-Wformat-nonliteral]
utf8.c:332:17: warning: format not a string literal, argument types not checked [-Wformat-nonliteral]
utf8.c:336:17: warning: format not a string literal, argument types not checked [-Wformat-nonliteral]
utf8.c:347:9: warning: format not a string literal, argument types not checked [-Wformat-nonliteral]
utf8.c: In function ‘S__to_utf8_case’:
regexec.c: In function ‘S_find_byclass’:
regexec.c:3075:33: warning: declaration of ‘tmp’ shadows a previous local [-Wshadow]
utf8.c: In function ‘Perl__to_utf8_fold_flags’:
utf8.c:4026:10: warning: declaration of ‘e’ shadows a parameter [-Wshadow]
utf8.c: In function ‘Perl__core_swash_init’:
utf8.c: In function ‘Perl_swash_fetch’:
utf8.c: In function ‘S_swatch_get’:
regexec.c: In function ‘S_regmatch’:
utf8.c:4898:6: warning: declaration of ‘s’ shadows a previous local [-Wshadow]
utf8.c:4974:16: warning: declaration of ‘send’ shadows a previous local [-Wshadow]
utf8.c: In function ‘Perl__swash_inversion_hash’:
utf8.c: In function ‘Perl__swash_to_invlist’:
regexec.c:7184:22: warning: declaration of ‘startpoint’ shadows a previous local [-Wshadow]
cop.h:1043:11: warning: declaration of ‘next’ shadows a previous local [-Wshadow]
utf8.c: In function ‘Perl__get_swash_invlist’:
regexec.c:7898:10: warning: declaration of ‘n’ shadows a previous local [-Wshadow]
regexec.c:8559:7: warning: declaration of ‘n’ shadows a previous local [-Wshadow]
taint.c: In function ‘Perl_taint_env’:
taint.c:162:21: warning: declaration of ‘e’ shadows a previous local [-Wshadow]
taint.c:180:21: warning: declaration of ‘svp’ shadows a previous local [-Wshadow]
universal.c: In function ‘XS_UNIVERSAL_can’:
universal.c: In function ‘XS_Internals_hv_clear_placehold’:
universal.c: In function ‘XS_re_regnames’:
vxs.inc: In function ‘XS_universal_version’:
perlio.c: In function ‘PerlIO_find_layer’:
perlio.c: In function ‘PerlIOStdio_dup’:
perlio.c:3153:10: warning: declaration of ‘fd’ shadows a previous local [-Wshadow]
regexec.c: In function ‘S_regtry’:
inline.h:289:1: warning: inlining failed in call to ‘Perl_valid_utf8_to_uvchr’: call is unlikely and code size would grow [-Winline]
numeric.c: In function ‘Perl_grok_numeric_radix’:
numeric.c: In function ‘Perl_grok_infnan’:
numeric.c:690:29: warning: declaration of ‘flags’ shadows a previous local [-Wshadow]
numeric.c:702:29: warning: declaration of ‘flags’ shadows a previous local [-Wshadow]
numeric.c: In function ‘S_mulexp10’:
numeric.c:1121:15: warning: comparing floating point with == or != is unsafe [-Wfloat-equal]
numeric.c:1170:16: warning: comparing floating point with == or != is unsafe [-Wfloat-equal]
numeric.c:1174:19: warning: comparing floating point with == or != is unsafe [-Wfloat-equal]
numeric.c: In function ‘Perl_my_atof’:
mathoms.c:147:1: warning: no previous prototype for ‘Perl_sv_2nv’ [-Wmissing-prototypes]
mathoms.c:559:1: warning: no previous prototype for ‘Perl_huge’ [-Wmissing-prototypes]
mathoms.c:1075:1: warning: no previous prototype for ‘Perl_sv_eq’ [-Wmissing-prototypes]
mathoms.c:1082:1: warning: no previous prototype for ‘Perl_sv_collxfrm’ [-Wmissing-prototypes]
mathoms.c:1101:1: warning: no previous prototype for ‘Perl_sv_2bool’ [-Wmissing-prototypes]
locale.c: In function ‘S_new_ctype’:
locale.c:759:17: warning: format not a string literal, argument types not checked [-Wformat-nonliteral]
locale.c: In function ‘Perl__warn_problematic_locale’:
locale.c:791:30: warning: format not a string literal, argument types not checked [-Wformat-nonliteral]
pp_pack.c: In function ‘S_utf8_to_bytes’:
pp_pack.c:310:16: warning: declaration of ‘flags’ shadows a previous local [-Wshadow]
pp_pack.c: In function ‘S_unpack_rec’:
pp_pack.c:939:10: warning: declaration of ‘sv’ shadows a previous local [-Wshadow]
pp_pack.c:1293:14: warning: declaration of ‘len’ shadows a previous local [-Wshadow]
locale.c: In function ‘Perl__is_in_locale_category’:
locale.c:3692:9: warning: declaration of ‘categories’ shadows a global declaration [-Wshadow]
pp_pack.c: In function ‘S_pack_rec’:
pp_pack.c:2917:23: warning: declaration of ‘from’ shadows a previous local [-Wshadow]
pp_pack.c:2920:23: warning: declaration of ‘len’ shadows a previous local [-Wshadow]
pp_sort.c: In function ‘Perl_pp_sort’:
cop.h:1045:10: warning: declaration of ‘i’ shadows a previous local [-Wshadow]
pp_sort.c:1004:15: warning: declaration of ‘av’ shadows a previous local [-Wshadow]
cop.h:1072:10: warning: declaration of ‘i’ shadows a previous local [-Wshadow]
pp_sort.c: In function ‘S_amagic_ncmp’:
pp_sort.c:1254:66: warning: comparing floating point with == or != is unsafe [-Wfloat-equal]
pp_sort.c: In function ‘S_amagic_i_ncmp’:
pp_sort.c: In function ‘S_amagic_cmp’:
pp_sort.c: In function ‘S_amagic_cmp_locale’:
time64.c: In function ‘Perl_gmtime64_r’:
time64.c:367:17: warning: cast from function call of type ‘double’ to non-matching type ‘int’ [-Wbad-function-cast]
time64.c:369:17: warning: cast from function call of type ‘double’ to non-matching type ‘int’ [-Wbad-function-cast]
time64.c:371:17: warning: cast from function call of type ‘double’ to non-matching type ‘int’ [-Wbad-function-cast]
time64.c:379:17: warning: cast from function call of type ‘double’ to non-matching type ‘int’ [-Wbad-function-cast]
time64.c:391:28: warning: cast from function call of type ‘double’ to non-matching type ‘int’ [-Wbad-function-cast]
time64.c:417:18: warning: cast from function call of type ‘double’ to non-matching type ‘int’ [-Wbad-function-cast]
time64.c: In function ‘Perl_localtime64_r’:
time64.c:502:17: warning: cast from function call of type ‘Time64_T {aka double}’ to non-matching type ‘long int’ [-Wbad-function-cast]
perl.h:173:22: warning: declaration of ‘my_perl’ shadows a global declaration [-Wshadow]
perly.y: In function ‘Perl_yyparse’:
../../perl.h:1296:5: warning: "VMS" is not defined [-Wundef]
../../inline.h: In function ‘S_cx_popsub_args’:
../../handy.h:57:35: warning: declaration of ‘_p’ shadows a previous local [-Wshadow]
dlutils.c: In function ‘dl_generic_private_init’:
../../perl.h:6059:12: warning: declaration of ‘my_cxtp’ shadows a previous local [-Wshadow]
dlutils.c: In function ‘SaveError’:
ptable.h:76:16: warning: function declaration isn’t a prototype [-Wstrict-prototypes]
arybase.xs: In function ‘ab_ck_base’:
../../perl.h:173:22: warning: declaration of ‘my_perl’ shadows a parameter [-Wshadow]
attributes.xs: In function ‘modify_SV_attributes’:
B.c: In function ‘XS_B__UNOP_AUX_string’:
B.c:1474:8: warning: declaration of ‘cv’ shadows a parameter [-Wshadow]
B.c: In function ‘XS_B__UNOP_AUX_aux_list’:
B.c:1541:8: warning: declaration of ‘cv’ shadows a parameter [-Wshadow]
B.xs:1260:25: warning: declaration of ‘p’ shadows a previous local [-Wshadow]
B.xs:1291:32: warning: declaration of ‘items’ shadows a previous local [-Wshadow]
B.xs: In function ‘XS_B__MAGIC_MOREMAGIC’:
../../pp.h:304:21: warning: declaration of ‘ix’ shadows a previous local [-Wshadow]
B.xs: In function ‘XS_B__GV_SV’:
B.xs:1856:22: warning: declaration of ‘gv’ shadows a previous local [-Wshadow]
B.c: In function ‘XS_B__CV_CONST’:
B.c:2718:8: warning: declaration of ‘cv’ shadows a parameter [-Wshadow]
B.c: In function ‘XS_B__CV_START’:
B.c:2747:8: warning: declaration of ‘cv’ shadows a parameter [-Wshadow]
B.c: In function ‘XS_B__CV_DEPTH’:
B.c:2773:8: warning: declaration of ‘cv’ shadows a parameter [-Wshadow]
B.c: In function ‘XS_B__CV_PADLIST’:
B.c:2799:8: warning: declaration of ‘cv’ shadows a parameter [-Wshadow]
B.c: In function ‘XS_B__CV_HSCXT’:
B.c:2831:8: warning: declaration of ‘cv’ shadows a parameter [-Wshadow]
B.c: In function ‘XS_B__CV_XSUB’:
B.c:2859:8: warning: declaration of ‘cv’ shadows a parameter [-Wshadow]
B.c: In function ‘XS_B__CV_const_sv’:
B.c:2890:8: warning: declaration of ‘cv’ shadows a parameter [-Wshadow]
B.c: In function ‘XS_B__CV_GV’:
B.c:2915:8: warning: declaration of ‘cv’ shadows a parameter [-Wshadow]
B.c: In function ‘XS_B__CV_NAME_HEK’:
B.c:2939:8: warning: declaration of ‘cv’ shadows a parameter [-Wshadow]
./const-xs.inc: In function ‘boot_B’:
./const-xs.inc:405:7: warning: declaration of ‘he’ shadows a previous local [-Wshadow]
./const-xs.inc:429:11: warning: declaration of ‘cv’ shadows a parameter [-Wshadow]
B.xs:606:9: warning: declaration of ‘cv’ shadows a parameter [-Wshadow]
B.xs:607:17: warning: declaration of ‘file’ shadows a previous local [-Wshadow]
compress.c:22:13: warning: no previous prototype for ‘compress2’ [-Wmissing-prototypes]
compress.c:68:13: warning: no previous prototype for ‘compress’ [-Wmissing-prototypes]
compress.c:81:15: warning: no previous prototype for ‘compressBound’ [-Wmissing-prototypes]
uncompr.c:27:13: warning: no previous prototype for ‘uncompress2’ [-Wmissing-prototypes]
uncompr.c:86:13: warning: no previous prototype for ‘uncompress’ [-Wmissing-prototypes]
Zlib.xs:505:8: warning: no previous prototype for ‘my_zcalloc’ [-Wmissing-prototypes]
Zlib.xs:514:6: warning: no previous prototype for ‘my_zcfree’ [-Wmissing-prototypes]
Zlib.xs:694:1: warning: no previous prototype for ‘flushParams’ [-Wmissing-prototypes]
Zlib.xs: In function ‘XS_Compress__Raw__Zlib__inflateInit’:
Cwd.c: In function ‘boot_Cwd’:
Cwd.c:1109:5: warning: "XSubPPtmpAAAB" is not defined [-Wundef]
Cwd.xs:557:5: warning: "XSubPPtmpAAAB" is not defined [-Wundef]
Bzip2.xs:123:6: warning: no previous prototype for ‘bz_internal_error’ [-Wmissing-prototypes]
Dumper.xs: In function ‘DD_dump’:
Dumper.xs:959:17: warning: declaration of ‘iname’ shadows a previous local [-Wshadow]
Dumper.xs:1060:13: warning: declaration of ‘key’ shadows a previous local [-Wshadow]
Dumper.xs:1170:21: warning: declaration of ‘i’ shadows a previous local [-Wshadow]
Dumper.xs:1241:9: warning: declaration of ‘i’ shadows a previous local [-Wshadow]
../../perl.h:1521:52: warning: declaration of ‘len’ shadows a previous local [-Wshadow]
Dumper.xs: In function ‘XS_Data__Dumper_Dumpxs’:
Dumper.xs:1656:12: warning: declaration of ‘i’ shadows a previous local [-Wshadow]
version.c:34:1: warning: no previous prototype for ‘__getBerkeleyDBInfo’ [-Wmissing-prototypes]
Peek.c: In function ‘XS_Devel__Peek_CvGV’:
Peek.c:802:7: warning: declaration of ‘cv’ shadows a parameter [-Wshadow]
Peek.xs: In function ‘boot_Devel__Peek’:
Peek.xs:445:16: warning: declaration of ‘cv’ shadows a parameter [-Wshadow]
Peek.c: In function ‘XS_Devel__Peek_mstats_fillhash’:
../../inline.h:141:1: warning: inlining failed in call to ‘S_POPMARK’: call is unlikely and code size would grow [-Winline]
Peek.c: In function ‘XS_Devel__Peek_mstats2hash’:
Peek.c: In function ‘XS_Devel__Peek_fill_mstats’:
DB_File.xs:128:5: warning: function declaration isn’t a prototype [-Wstrict-prototypes]
DB_File.xs: In function ‘ParseOpenInfo’:
DB_File.xs:1409:7: warning: declaration of ‘flags’ shadows a parameter [-Wshadow]
DB_File.xs:1485:14: warning: declaration of ‘status’ shadows a previous local [-Wshadow]
DB_File.xs: In function ‘boot_DB_File’:
MD5.c: In function ‘boot_Digest__MD5’:
MD5.c:1120:14: warning: declaration of ‘cv’ shadows a parameter [-Wshadow]
module2.c:30:6: warning: no previous prototype for ‘call_newCONSTSUB_2’ [-Wmissing-prototypes]
module2.c:35:5: warning: no previous prototype for ‘get_PL_signals_2’ [-Wmissing-prototypes]
module2.c:40:5: warning: no previous prototype for ‘no_dummy_parser_vars’ [-Wmissing-prototypes]
module3.c:31:5: warning: no previous prototype for ‘exception’ [-Wmissing-prototypes]
module3.c:52:6: warning: no previous prototype for ‘call_newCONSTSUB_3’ [-Wmissing-prototypes]
module3.c:57:5: warning: no previous prototype for ‘get_PL_signals_3’ [-Wmissing-prototypes]
module3.c:62:5: warning: no previous prototype for ‘dummy_parser_warning’ [-Wmissing-prototypes]
RealPPPort.xs:211:6: warning: no previous prototype for ‘call_newCONSTSUB_1’ [-Wmissing-prototypes]
RealPPPort.xs:262:5: warning: no previous prototype for ‘get_PL_signals_1’ [-Wmissing-prototypes]
RealPPPort.xs: In function ‘XS_Devel__PPPort_TestSvSTASH_set’:
src/sha64bit.c: In function ‘sha512’:
src/sha.h:97:34: warning: declaration of ‘t’ shadows a previous local [-Wshadow]
RealPPPort.xs: In function ‘XS_Devel__PPPort_ptrtests’:
RealPPPort.xs:1653:37: warning: comparing floating point with == or != is unsafe [-Wfloat-equal]
RealPPPort.xs: In function ‘XS_Devel__PPPort_my_snprintf’:
RealPPPort.c: In function ‘XS_Devel__PPPort_croak_xs_usage’:
RealPPPort.c: In function ‘XS_Devel__PPPort_with_THX_arg’:
RealPPPort.c: In function ‘XS_Devel__PPPort_croak_sv’:
RealPPPort.c: In function ‘XS_Devel__PPPort_croak_memory_wrap’:
RealPPPort.c: In function ‘XS_Devel__PPPort_croak_no_modify’:
RealPPPort.c: In function ‘XS_Devel__PPPort_die_sv’:
RealPPPort.c: In function ‘XS_Devel__PPPort_croak_NVgf’:
Fcntl.xs: In function ‘XS_Fcntl_S_ISREG’:
./const-xs.inc: In function ‘boot_Fcntl’:
./const-xs.inc:516:11: warning: declaration of ‘cv’ shadows a parameter [-Wshadow]
Fcntl.xs:89:13: warning: declaration of ‘cv’ shadows a parameter [-Wshadow]
../../../perl.h:1296:5: warning: "VMS" is not defined [-Wundef]
DosGlob.xs: In function ‘boot_File__DosGlob’:
../../../inline.h: In function ‘S_cx_popsub_args’:
../../../handy.h:57:35: warning: declaration of ‘_p’ shadows a previous local [-Wshadow]
Encode.xs: In function ‘XS_Encode__utf8_decode’:
../../pp.h:81:19: warning: declaration of ‘sp’ shadows a previous local [-Wshadow]
Glob.xs: In function ‘boot_File__Glob’:
./const-xs.inc:92:11: warning: declaration of ‘cv’ shadows a parameter [-Wshadow]
GDBM_File.xs:28:6: warning: "GDBM_VERSION_MAJOR" is not defined [-Wundef]
GDBM_File.xs:31:1: warning: function declaration isn’t a prototype [-Wstrict-prototypes]
GDBM_File.c: In function ‘boot_GDBM_File’:
GDBM_File.c:801:14: warning: declaration of ‘cv’ shadows a parameter [-Wshadow]
./const-xs.inc:94:11: warning: declaration of ‘cv’ shadows a parameter [-Wshadow]
Util.xs: In function ‘XS_Hash__Util_hidden_ref_keys’:
../../hv_func.h: In function ‘S_perl_hash_with_seed’:
../../sbox32_hash.h:1493:26: warning: inlining failed in call to ‘sbox32_hash_with_state’: --param max-inline-insns-single limit reached [-Winline]
../../stadtx_hash.h:185:26: warning: inlining failed in call to ‘stadtx_hash_with_state’: --param max-inline-insns-single limit reached [-Winline]
Util.xs: In function ‘XS_Hash__Util_hash_value’:
../../hv_func.h:104:5: warning: inlining failed in call to ‘S_perl_hash_with_seed’: --param large-stack-frame-growth limit reached [-Winline]
FieldHash.xs:347:5: warning: no previous prototype for ‘HUF_inc_var’ [-Wmissing-prototypes]
FieldHash.c: In function ‘boot_Hash__Util__FieldHash’:
FieldHash.c:744:14: warning: declaration of ‘cv’ shadows a parameter [-Wshadow]
./const-xs.inc: In function ‘boot_I18N__Langinfo’:
./const-xs.inc:220:11: warning: declaration of ‘cv’ shadows a parameter [-Wshadow]
IO.xs: In function ‘XS_IO__Handle__create_getline_subs’:
ListUtil.xs: In function ‘XS_List__Util_reduce’:
ListUtil.xs:400:9: warning: declaration of ‘cv’ shadows a parameter [-Wshadow]
../../cop.h:1132:13: warning: declaration of ‘cv’ shadows a previous local [-Wshadow]
ListUtil.xs: In function ‘XS_List__Util_first’:
ListUtil.xs:461:9: warning: declaration of ‘cv’ shadows a parameter [-Wshadow]
ListUtil.xs: In function ‘XS_List__Util_any’:
ListUtil.xs:536:9: warning: declaration of ‘cv’ shadows a parameter [-Wshadow]
ListUtil.xs: In function ‘XS_List__Util_pairfirst’:
ListUtil.xs:714:9: warning: declaration of ‘cv’ shadows a parameter [-Wshadow]
ListUtil.xs: In function ‘XS_List__Util_pairgrep’:
ListUtil.xs:794:9: warning: declaration of ‘cv’ shadows a parameter [-Wshadow]
../../cop.h:1045:10: warning: declaration of ‘i’ shadows a previous local [-Wshadow]
../../cop.h:1072:10: warning: declaration of ‘i’ shadows a previous local [-Wshadow]
ListUtil.xs: In function ‘XS_List__Util_pairmap’:
ListUtil.xs:884:9: warning: declaration of ‘cv’ shadows a parameter [-Wshadow]
ListUtil.xs:906:13: warning: declaration of ‘ret_gimme’ shadows a previous local [-Wshadow]
ListUtil.xs: In function ‘XS_Sub__Util_set_prototype’:
ListUtil.xs:1424:9: warning: declaration of ‘cv’ shadows a parameter [-Wshadow]
ListUtil.xs: In function ‘XS_Sub__Util_set_subname’:
ListUtil.xs:1451:9: warning: declaration of ‘cv’ shadows a parameter [-Wshadow]
ListUtil.xs: In function ‘XS_Sub__Util_subname’:
ListUtil.xs:1560:9: warning: declaration of ‘cv’ shadows a parameter [-Wshadow]
mro.xs: In function ‘S_mro_get_linear_isa_c3’:
mro.xs: In function ‘XS_mro__nextcan’:
NDBM_File.c: In function ‘boot_NDBM_File’:
NDBM_File.c:627:14: warning: declaration of ‘cv’ shadows a parameter [-Wshadow]
ODBM_File.c: In function ‘XS_ODBM_File_DELETE’:
ODBM_File.c: In function ‘boot_ODBM_File’:
ODBM_File.c:649:14: warning: declaration of ‘cv’ shadows a parameter [-Wshadow]
encoding.xs: In function ‘PerlIOEncode_getarg’:
encoding.xs: In function ‘PerlIOEncode_pushed’:
encoding.xs: In function ‘PerlIOEncode_fill’:
encoding.xs: In function ‘PerlIOEncode_flush’:
encoding.xs: In function ‘boot_PerlIO__encoding’:
scalar.xs:19:1: warning: no previous prototype for ‘PerlIOScalar_eof’ [-Wmissing-prototypes]
scalar.xs: In function ‘PerlIOScalar_pushed’:
scalar.xs: In function ‘PerlIOScalar_dup’:
via.xs: In function ‘PerlIOVia_method’:
POSIX.xs:1016:12: warning: function declaration isn’t a prototype [-Wstrict-prototypes]
POSIX.c: In function ‘XS_POSIX__SigSet_addset’:
POSIX.c: In function ‘XS_POSIX__SigSet_emptyset’:
POSIX.c: In function ‘XS_POSIX__SigSet_ismember’:
POSIX.c: In function ‘XS_POSIX__Termios_getattr’:
POSIX.c: In function ‘XS_POSIX__Termios_setattr’:
POSIX.c: In function ‘XS_POSIX__Termios_getispeed’:
POSIX.c: In function ‘XS_POSIX__Termios_getiflag’:
POSIX.c: In function ‘XS_POSIX__Termios_getcc’:
POSIX.c: In function ‘XS_POSIX__Termios_setispeed’:
re_exec.c: In function ‘my_re_intuit_start’:
re_exec.c:1062:17: warning: declaration of ‘sv’ shadows a parameter [-Wshadow]
POSIX.c: In function ‘XS_POSIX__Termios_setiflag’:
POSIX.c: In function ‘XS_POSIX__Termios_setcc’:
POSIX.xs: In function ‘XS_POSIX_localeconv’:
POSIX.xs: In function ‘XS_POSIX_sigaction’:
POSIX.c: In function ‘XS_POSIX_sigpending’:
POSIX.xs: In function ‘XS_POSIX_sigprocmask’:
re_exec.c: In function ‘S_find_byclass’:
re_exec.c:3075:33: warning: declaration of ‘tmp’ shadows a previous local [-Wshadow]
POSIX.xs: In function ‘XS_POSIX_strtod’:
POSIX.xs: In function ‘XS_POSIX_strtold’:
./const-xs.inc: In function ‘boot_POSIX’:
./const-xs.inc:1369:11: warning: declaration of ‘cv’ shadows a parameter [-Wshadow]
re_exec.c: In function ‘S_regmatch’:
re_exec.c:7184:22: warning: declaration of ‘startpoint’ shadows a previous local [-Wshadow]
../../regcomp.h:1066:45: warning: declaration of ‘re_debug_flags’ shadows a previous local [-Wshadow]
../../cop.h:1043:11: warning: declaration of ‘next’ shadows a previous local [-Wshadow]
re_exec.c:7898:10: warning: declaration of ‘n’ shadows a previous local [-Wshadow]
re_exec.c:8559:7: warning: declaration of ‘n’ shadows a previous local [-Wshadow]
POSIX.c: In function ‘XS_POSIX_abort’:
POSIX.c: In function ‘XS_POSIX__exit’:
POSIX.c: In function ‘XS_POSIX_constant’:
SDBM_File.c: In function ‘boot_SDBM_File’:
SDBM_File.c:609:14: warning: declaration of ‘cv’ shadows a parameter [-Wshadow]
./const-xs.inc: In function ‘boot_Socket’:
./const-xs.inc:922:11: warning: declaration of ‘cv’ shadows a parameter [-Wshadow]
re_comp.c: In function ‘S_get_ANYOF_cp_list_for_ssc’:
Storable.xs: In function ‘init_perinterp’:
re_comp.c: In function ‘S_make_trie’:
re_comp.c:3353:49: warning: declaration of ‘tmp’ shadows a previous local [-Wshadow]
re_comp.c:3354:26: warning: declaration of ‘ch’ shadows a previous local [-Wshadow]
re_comp.c:3374:28: warning: declaration of ‘len’ shadows a previous local [-Wshadow]
Storable.xs: In function ‘free_context’:
re_comp.c: In function ‘S_study_chunk’:
re_comp.c:4487:34: warning: declaration of ‘last’ shadows a parameter [-Wshadow]
Storable.xs: In function ‘is_storing’:
Storable.xs: In function ‘is_retrieving’:
Storable.xs: In function ‘last_op_in_netorder’:
Storable.xs: In function ‘pkg_fetchmeth’:
Storable.xs: In function ‘pkg_can’:
Storable.xs: In function ‘scalar_call’:
Storable.xs: In function ‘array_call’:
re_comp.c: In function ‘S_concat_pat’:
re_comp.c:6383:33: warning: declaration of ‘svp’ shadows a previous local [-Wshadow]
re_comp.c:6431:17: warning: declaration of ‘sv’ shadows a previous local [-Wshadow]
Storable.xs: In function ‘store_scalar’:
Storable.xs:2602:27: warning: declaration of ‘len’ shadows a previous local [-Wshadow]
re_comp.c: In function ‘S_compile_runtime_code’:
../../cop.h:1045:26: warning: declaration of ‘p’ shadows a previous local [-Wshadow]
../../cop.h:1072:27: warning: declaration of ‘p’ shadows a previous local [-Wshadow]
re_comp.c: In function ‘my_re_op_compile’:
re_comp.c:7888:24: warning: declaration of ‘scan’ shadows a previous local [-Wshadow]
re_comp.c: In function ‘my_reg_named_buff_scalar’:
Storable.xs: In function ‘store_other’:
Storable.xs:1069:17: warning: declaration of ‘buf’ shadows a previous local [-Wshadow]
Storable.xs: In function ‘do_store’:
Storable.xs: In function ‘mbuf2sv’:
Storable.xs: In function ‘retrieve_hook_common’:
Storable.xs:1232:10: warning: declaration of ‘buf’ shadows a previous local [-Wshadow]
re_comp.c: In function ‘S_reg’:
re_comp.c:8441:9: warning: declaration of ‘num’ shadows a previous local [-Wshadow]
re_comp.c:11269:18: warning: declaration of ‘num’ shadows a previous local [-Wshadow]
Storable.xs: In function ‘magic_check’:
Storable.xs: In function ‘do_retrieve’:
Storable.xs: In function ‘dclone’:
Storable.xs:500:9: warning: declaration of ‘perinterp_sv’ shadows a previous local [-Wshadow]
Storable.xs:510:27: warning: declaration of ‘cxt’ shadows a previous local [-Wshadow]
Storable.xs: In function ‘XS_Storable_last_op_in_netorder’:
re_comp.c: In function ‘S_grok_bslash_N’:
re_comp.c:649:8: warning: declaration of ‘len’ shadows a previous local [-Wshadow]
re_comp.c: In function ‘S_regatom’:
re_comp.c:13572:12: warning: declaration of ‘flags’ shadows a previous local [-Wshadow]
re_comp.c:13598:12: warning: declaration of ‘len’ shadows a previous local [-Wshadow]
re_comp.c: In function ‘S_handle_regex_sets’:
re_comp.c:15269:34: warning: declaration of ‘save_parse’ shadows a previous local [-Wshadow]
re_comp.c:15481:25: warning: declaration of ‘lhs’ shadows a previous local [-Wshadow]
re_comp.c: In function ‘my_regfree’:
re_comp.c: In function ‘S_put_charclass_bitmap_innards’:
re_comp.c:20845:21: warning: declaration of ‘i’ shadows a previous local [-Wshadow]
re_comp.c: In function ‘S_dumpuntil’:
re_comp.c:21080:17: warning: declaration of ‘op’ shadows a previous local [-Wshadow]
re_comp.c:9935:1: warning: inlining failed in call to ‘S_invlist_clone’: --param max-inline-insns-single limit reached [-Winline]
re_comp.c: In function ‘S_ssc_finalize’:
re_comp.c:10608:1: warning: inlining failed in call to ‘S_handle_named_backref’: call is unlikely and code size would grow [-Winline]
re_comp.c: In function ‘S_regclass’:
../../dquote_inline.h:39:1: warning: inlining failed in call to ‘S_form_short_octal_warning’: call is unlikely and code size would grow [-Winline]
re_comp.c:12371:1: warning: inlining failed in call to ‘S_compute_EXACTish’: call is unlikely and code size would grow [-Winline]
re_comp.c:12393:1: warning: inlining failed in call to ‘S_alloc_maybe_populate_EXACT’: call is unlikely and code size would grow [-Winline]
re_comp.c:9970:1: warning: inlining failed in call to ‘S_invlist_iterinit’: call is unlikely and code size would grow [-Winline]
re_comp.c:9978:1: warning: inlining failed in call to ‘S_invlist_iterfinish’: call is unlikely and code size would grow [-Winline]
re_comp.c:10029:1: warning: inlining failed in call to ‘S_invlist_highest’: call is unlikely and code size would grow [-Winline]
Syslog.c: In function ‘boot_Sys__Syslog’:
Syslog.c:569:5: warning: "XSubPPtmpAAAB" is not defined [-Wundef]
./const-xs.inc:255:11: warning: declaration of ‘cv’ shadows a parameter [-Wshadow]
./const-xs.inc:281:5: warning: "XSubPPtmpAAAB" is not defined [-Wundef]
threads.xs: In function ‘S_ithread_clear’:
threads.xs: In function ‘S_ithread_create’:
../../perl.h:173:22: warning: declaration of ‘my_perl’ shadows a previous local [-Wshadow]
threads.xs: In function ‘XS_threads_kill’:
shared.xs: In function ‘S_get_RV’:
shared.xs: In function ‘sharedsv_scalar_mg_get’:
../../sv.h:1213:17: warning: declaration of ‘_svrv’ shadows a previous local [-Wshadow]
shared.xs: In function ‘sharedsv_scalar_store’:
shared.xs:774:13: warning: declaration of ‘sv’ shadows a parameter [-Wshadow]
shared.xs: In function ‘sharedsv_scalar_mg_free’:
shared.xs:851:13: warning: declaration of ‘sv’ shadows a parameter [-Wshadow]
shared.xs: In function ‘sharedsv_elem_mg_FETCH’:
shared.xs: In function ‘sharedsv_elem_mg_dup’:
shared.xs: In function ‘sharedsv_array_mg_CLEAR’:
shared.xs:1106:21: warning: declaration of ‘sv’ shadows a parameter [-Wshadow]
re_comp.c: In function ‘S_study_chunk.constprop’:
re_comp.c:1866:1: warning: inlining failed in call to ‘S_ssc_add_range’: call is unlikely and code size would grow [-Winline]
re_comp.c:1838:1: warning: inlining failed in call to ‘S_ssc_union’: call is unlikely and code size would grow [-Winline]
re_comp.c:1851:1: warning: inlining failed in call to ‘S_ssc_intersection’: call is unlikely and code size would grow [-Winline]
NamedCapture.xs: In function ‘XS_Tie__Hash__NamedCapture_FETCH’:
NamedCapture.xs: In function ‘XS_Tie__Hash__NamedCapture_FIRSTKEY’:
Piece.xs: In function ‘XS_Time__Piece__strftime’:
Piece.xs:971:9: warning: format not a string literal, format string not checked [-Wformat-nonliteral]
Piece.xs:997:13: warning: format not a string literal, format string not checked [-Wformat-nonliteral]
Piece.xs: In function ‘XS_Time__Piece__crt_localtime’:

-- 
Report by Test::Smoke v1.53 build 1374 running on perl 5.24.1
(Reporter v0.050 / Smoker v0.045)



nntp.perl.org: Perl Programming lists via nntp and http.
Comments to Ask Bjørn Hansen at ask@perl.org | Group listing | About