develooper Front page | perl.daily-build.reports | Postings from February 2018

Smoke [5.27.9] v5.27.8-186-gbdb88ee FAIL(Fm) darwin 15.6.0 (IntelCore 2 Duo/)

From:
tony
Date:
February 8, 2018 06:37
Subject:
Smoke [5.27.9] v5.27.8-186-gbdb88ee FAIL(Fm) darwin 15.6.0 (IntelCore 2 Duo/)
Message ID:
201802080637.w186bPln015697@mars.tony.develop-help.com
Automated smoke report for 5.27.9 patch bdb88ee8a417b4dd17c7496144cbaa8ab8f2a25f v5.27.8-186-gbdb88ee
neptune.local: iMac (2.4 GHz) (Intel Core 2 Duo/)
    on        darwin - 15.6.0 (Mac OS X)
    using     cc version 4.2.1 Compatible Apple LLVM 8.0.0 (clang-800.0.42.1)
    smoketime 8 hours 55 minutes (average 33 minutes 26 seconds)

Summary: FAIL(Fm)

O = OK  F = Failure(s), extended report at the bottom
X = Failure(s) under TEST but not under harness
? = still running or test results not (yet) available
Build failures during:       - = unknown or N/A
c = Configure, m = make, M = make (after miniperl), t = make test-prep

v5.27.8-186-gbdb88ee  Configuration (common) none
----------- ---------------------------------------------------------
m - m -     
m - m -     -Duse64bitint
m - m -     -Dusedtrace
m - m -     -Dusemorebits
F F F F     -Duseithreads
F F F F     -Duseithreads -Duse64bitint
F F F F     -Duseithreads -Dusedtrace
F F F F     -Duseithreads -Dusemorebits
| | | +----- PERLIO = perlio -DDEBUGGING
| | +------- PERLIO = stdio  -DDEBUGGING
| +--------- PERLIO = perlio
+----------- PERLIO = stdio


Locally applied patches:
    uncommitted-changes
    SMOKEbdb88ee8a417b4dd17c7496144cbaa8ab8f2a25f

Testsuite was run only with 'harness' and HARNESS_OPTIONS=j3

Failures: (common-args) none
[stdio/perlio] -Duseithreads
[stdio/perlio] -DDEBUGGING -Duseithreads
[stdio/perlio] -Duseithreads -Duse64bitint
[stdio/perlio] -DDEBUGGING -Duseithreads -Duse64bitint
[stdio/perlio] -Duseithreads -Dusedtrace
[stdio/perlio] -DDEBUGGING -Duseithreads -Dusedtrace
[stdio/perlio] -Duseithreads -Dusemorebits
[stdio/perlio] -DDEBUGGING -Duseithreads -Dusemorebits
../t/run/locale.t...........................................FAILED
    8

Compiler messages(gcc):
locale.c:1357:5: error: use of undeclared identifier 'PL_underlying_numeric_obj'
locale.c:1359:43: error: use of undeclared identifier 'PL_underlying_numeric_obj'
locale.c:2178:5: error: use of undeclared identifier 'PERL_ARGS_ASSERT_SAVE_TO_BUFFER'
locale.c:2387:9: warning: implicit declaration of function 'save_to_buffer' [-Wimplicit-function-declaration]
locale.c:4726:42: warning: field precision should have type 'int', but argument has type 'long' [-Wformat]
locale.c:4736:42: warning: field precision should have type 'int', but argument has type 'long' [-Wformat]
locale.c:4745:45: warning: field precision should have type 'int', but argument has type 'long' [-Wformat]
locale.c:4753:46: warning: field precision should have type 'int', but argument has type 'long' [-Wformat]

-- 
Report by Test::Smoke v1.43 build 1271 running on perl 5.18.2
(Reporter v0.035 / Smoker v0.045)

Logs at http://perl.develop-help.com/reports/
Branch: remotes/origin/smoke-me/khw-locale
Configuration: default



nntp.perl.org: Perl Programming lists via nntp and http.
Comments to Ask Bjørn Hansen at ask@perl.org | Group listing | About