develooper Front page | perl.daily-build.reports | Postings from February 2018

Smoke [smoke-me/khw-locale] v5.27.8-186-gbdb88ee8a4 FAIL(Fm) freebsd10.4-RELEASE-p3 (amd64/1 cpu)

From:
Carlos Guevara
Date:
February 8, 2018 06:00
Subject:
Smoke [smoke-me/khw-locale] v5.27.8-186-gbdb88ee8a4 FAIL(Fm) freebsd10.4-RELEASE-p3 (amd64/1 cpu)
Message ID:
201802080600.w1860SqX041480@cjg-freebsd10
Automated smoke report for branch smoke-me/khw-locale 5.27.9 patch bdb88ee8a417b4dd17c7496144cbaa8ab8f2a25f v5.27.8-186-gbdb88ee8a4
cjg-freebsd10: Intel(R) Xeon(R) CPU           E5420  @ 2.50GHz (amd64/1 cpu)
    on        freebsd - 10.4-RELEASE-p3
    using     cc version 4.2.1 Compatible FreeBSD Clang 3.4.1 (tags/RELEASE_34/dot1-final 208032)
    smoketime 3 hours 32 minutes (average 26 minutes 34 seconds)

Summary: FAIL(Fm)

O = OK  F = Failure(s), extended report at the bottom
X = Failure(s) under TEST but not under harness
? = still running or test results not (yet) available
Build failures during:       - = unknown or N/A
c = Configure, m = make, M = make (after miniperl), t = make test-prep

v5.27.8-186-gbdb88ee8a4  Configuration (common) none
----------- ---------------------------------------------------------
m m         
m m         -Duse64bitall
F F         -Duseithreads
F F         -Duseithreads -Duse64bitall
| +--------- -DDEBUGGING
+----------- no debugging


Locally applied patches:
    SMOKEbdb88ee8a417b4dd17c7496144cbaa8ab8f2a25f

Testsuite was run only with 'harness'

Tests skipped on user request:
    # One test name on a line
Failures: (common-args) none
[default] -Duseithreads
[default] -DDEBUGGING -Duseithreads
[default] -Duseithreads -Duse64bitall
[default] -DDEBUGGING -Duseithreads -Duse64bitall
../t/run/locale.t...........................................FAILED
    7-8, 10-23, 25, 28-29
../ext/XS-APItest/t/handy00.t...............................FAILED
    No plan found in TAP output
../lib/warnings.t...........................................FAILED
    710, 712, 714, 901

Compiler messages(gcc):
locale.c:1357:5: error: use of undeclared identifier 'PL_underlying_numeric_obj'
locale.c:1359:43: error: use of undeclared identifier 'PL_underlying_numeric_obj'
locale.c:2178:5: error: use of undeclared identifier 'PERL_ARGS_ASSERT_SAVE_TO_BUFFER'
locale.c:2387:9: warning: implicit declaration of function 'save_to_buffer' [-Wimplicit-function-declaration]

Non-Fatal messages(gcc):



-- 
Report by Test::Smoke v1.71 running on perl 5.26.1
(Reporter v0.053 / Smoker v0.046)



nntp.perl.org: Perl Programming lists via nntp and http.
Comments to Ask Bjørn Hansen at ask@perl.org | Group listing | About