develooper Front page | perl.daily-build.reports | Postings from February 2018

Smoke [blead] v5.27.8-165-g7c4a22ed65 FAIL(FM) HP-UX B.11.23/64(ia64/2 cpu)

From:
H.Merijn Brand
Date:
February 8, 2018 04:57
Subject:
Smoke [blead] v5.27.8-165-g7c4a22ed65 FAIL(FM) HP-UX B.11.23/64(ia64/2 cpu)
Message ID:
MAILCC4D4EA1@mail.procura.nl
Automated smoke report for branch blead 5.27.9 patch 7c4a22ed65ae021292a3c6b7a2736204e26c55cf v5.27.8-165-g7c4a22ed65
x1: Intel(R) Itanium 2 processor/1600 MHz (ia64/2 cpu)
    on        HP-UX - B.11.23/64
    using     ccache cc version B3910B A.06.25.02
    smoketime 7 hours 11 minutes (average 53 minutes 56 seconds)

Summary: FAIL(FM)

O = OK  F = Failure(s), extended report at the bottom
X = Failure(s) under TEST but not under harness
? = still running or test results not (yet) available
Build failures during:       - = unknown or N/A
c = Configure, m = make, M = make (after miniperl), t = make test-prep

v5.27.8-165-g7c4a22ed65  Configuration (common) none
----------- ---------------------------------------------------------
F F F O O O 
M - - M - - -Duse64bitall
M - - O O O -Duseithreads
O O O M - - -Duseithreads -Duse64bitall
| | | | | +- LC_ALL = univ.utf8 -DDEBUGGING
| | | | +--- PERLIO = perlio -DDEBUGGING
| | | +----- PERLIO = stdio  -DDEBUGGING
| | +------- LC_ALL = univ.utf8
| +--------- PERLIO = perlio
+----------- PERLIO = stdio 

Locally applied patches:
    SMOKE7c4a22ed65ae021292a3c6b7a2736204e26c55cf

Testsuite was run only with 'harness'

Tests skipped on user request:
    lib/Test/Simple/t/utf8.t
Failures: (common-args) none
[stdio] 
../t/base/lex.t.............................................FAILED
    81-86
../t/comp/fold.t............................................FAILED
    Non-zero exit status: 255
    No plan found in TAP output
../t/op/bop.t...............................................FAILED
    Non-zero exit status: 255
    No plan found in TAP output
../t/op/chr.t...............................................FAILED
    Non-zero exit status: 2
    No plan found in TAP output
../t/op/infnan.t............................................FAILED
    519-520, 523-524, 531-532, 539-540, 559-560
    563-564, 575-576, 579-580, 591-592, 595-596
    603-604, 607-608, 619-620, 623-624, 635-636
../t/op/lex_assign.t........................................FAILED
    287-293, 295, 298
../t/op/lex.t...............................................FAILED
    32
../t/op/pack.t..............................................FAILED
    Non-zero exit status: 255
    No plan found in TAP output
../t/op/repeat.t............................................FAILED
    Non-zero exit status: 2
    No plan found in TAP output
../t/op/split.t.............................................FAILED
    172
../t/op/sub_lval.t..........................................FAILED
    43
../t/op/svleak.t............................................FAILED
    23
../t/op/taint.t.............................................FAILED
    Non-zero exit status: 255
    No plan found in TAP output
../lib/warnings.t...........................................FAILED
    117, 119-122, 128-129, 141-143, 145-146
    150-152, 160, 163-167, 172, 524, 617, 659
    661, 731, 734-735, 738, 740, 813, 855, 875-880
    905-913

[perlio] 
../t/base/lex.t.............................................FAILED
    81-86
../t/comp/fold.t............................................FAILED
    Non-zero exit status: 255
    No plan found in TAP output
../t/op/svleak.t............................................FAILED
    23
../t/op/lex.t...............................................FAILED
    32
../t/op/infnan.t............................................FAILED
    519-520, 523-524, 531-532, 539-540, 559-560
    563-564, 575-576, 579-580, 591-592, 595-596
    603-604, 607-608, 619-620, 623-624, 635-636
../t/op/lex_assign.t........................................FAILED
    287-293, 295, 298
../t/op/sub_lval.t..........................................FAILED
    43
../t/op/split.t.............................................FAILED
    172
../t/op/pack.t..............................................FAILED
    Non-zero exit status: 255
    No plan found in TAP output
../t/op/bop.t...............................................FAILED
    Non-zero exit status: 255
    No plan found in TAP output
../t/op/chr.t...............................................FAILED
    Non-zero exit status: 2
    No plan found in TAP output
../t/op/repeat.t............................................FAILED
    Non-zero exit status: 255
    No plan found in TAP output
../t/op/taint.t.............................................FAILED
    Non-zero exit status: 255
    No plan found in TAP output
../cpan/ExtUtils-MakeMaker/t/eu_command.t...................FAILED
    8
    Non-zero exit status: 1
../lib/warnings.t...........................................FAILED
    117, 119-122, 128-129, 141-143, 145-146
    150-152, 160, 163-167, 172, 524, 617, 659
    661, 731, 734-735, 738, 740, 813, 855, 875-880
    905-913

[univ.utf8] 
../t/base/lex.t.............................................FAILED
    81-86
../t/comp/fold.t............................................FAILED
    Non-zero exit status: 255
    No plan found in TAP output
../t/op/lex.t...............................................FAILED
    32
../t/op/infnan.t............................................FAILED
    519-520, 523-524, 531-532, 539-540, 559-560
    563-564, 575-576, 579-580, 591-592, 595-596
    603-604, 607-608, 619-620, 623-624, 635-636
../t/op/svleak.t............................................FAILED
    23
../t/op/lex_assign.t........................................FAILED
    287-293, 295, 298
../t/op/split.t.............................................FAILED
    172
../t/op/sub_lval.t..........................................FAILED
    43
../t/op/pack.t..............................................FAILED
    Non-zero exit status: 255
    No plan found in TAP output
../t/op/taint.t.............................................FAILED
    Non-zero exit status: 255
    No plan found in TAP output
../t/op/repeat.t............................................FAILED
    Non-zero exit status: 255
    No plan found in TAP output
../t/op/bop.t...............................................FAILED
    Non-zero exit status: 255
    No plan found in TAP output
../t/op/chr.t...............................................FAILED
    Non-zero exit status: 2
    No plan found in TAP output
../lib/warnings.t...........................................FAILED
    117, 119-122, 128-129, 141-143, 145-146
    150-152, 160, 163-167, 172, 524, 617, 659
    661, 731, 734-735, 738, 740, 813, 855, 875-880
    905-913

Passed Todo tests: (common-args) none
[stdio/perlio] 
[stdio/perlio] -DDEBUGGING
[stdio/perlio] -DDEBUGGING -Duseithreads
[stdio/perlio] -Duseithreads -Duse64bitall
../dist/Net-Ping/t/450_service.t............................PASSED
    9, 18

[univ.utf8] 
[univ.utf8] -DDEBUGGING
[univ.utf8] -DDEBUGGING -Duseithreads
[univ.utf8] -Duseithreads -Duse64bitall
../lib/B/Deparse.t..........................................PASSED
    2
../dist/Net-Ping/t/450_service.t............................PASSED
    9, 18

Compiler messages(hpux):


Non-Fatal messages(hpux):


Status overview available here: https://smoke.procura.nl/

-- 
Report by Test::Smoke v1.71_01 running on perl 5.14.2
(Reporter v0.053 / Smoker v0.046)



nntp.perl.org: Perl Programming lists via nntp and http.
Comments to Ask Bjørn Hansen at ask@perl.org | Group listing | About