develooper Front page | perl.daily-build.reports | Postings from February 2018

Smoke [5.27.9] v5.27.8-165-g7c4a22ed65 FAIL(F) cygwin_nt-10.02.9.0(0.318/5/3) (AMD64/2 cpu)

From:
tony
Date:
February 8, 2018 01:56
Subject:
Smoke [5.27.9] v5.27.8-165-g7c4a22ed65 FAIL(F) cygwin_nt-10.02.9.0(0.318/5/3) (AMD64/2 cpu)
Message ID:
201802080156.w181u4HB026934@mars.tony.develop-help.com
Automated smoke report for 5.27.9 patch 7c4a22ed65ae021292a3c6b7a2736204e26c55cf v5.27.8-165-g7c4a22ed65
mimas: AMD64 Family 16 Model 10 Stepping 0, AuthenticAMD (AMD64/2 cpu)
    on        cygwin_nt-10.0 - 2.9.0(0.318/5/3)
    using     gcc version 6.4.0
    smoketime 5 hours 23 minutes (average 1 hour 20 minutes)

Summary: FAIL(F)

O = OK  F = Failure(s), extended report at the bottom
X = Failure(s) under TEST but not under harness
? = still running or test results not (yet) available
Build failures during:       - = unknown or N/A
c = Configure, m = make, M = make (after miniperl), t = make test-prep

v5.27.8-165-g7c4a22ed65  Configuration (common) none
----------- ---------------------------------------------------------
O O F O     -Uusethreads -Uusemymalloc
F F F F     -Duseithreads -Uusemymalloc
| | | +----- PERLIO = perlio -DDEBUGGING
| | +------- PERLIO = stdio  -DDEBUGGING
| +--------- PERLIO = perlio
+----------- PERLIO = stdio


Locally applied patches:
    SMOKE7c4a22ed65ae021292a3c6b7a2736204e26c55cf

Testsuite was run only with 'harness' and HARNESS_OPTIONS=j2

Failures: (common-args) none
[stdio] -DDEBUGGING -Uusethreads -Uusemymalloc
../dist/Time-HiRes/t/ualarm.t...............................FAILED
    8
    Non-zero exit status: 1

[stdio/perlio] -Duseithreads -Uusemymalloc
../dist/Time-HiRes/t/alarm.t................................FAILED
    6, 9
    Non-zero exit status: 2

[stdio] -DDEBUGGING -Duseithreads -Uusemymalloc
../dist/threads/t/exit.t....................................FAILED
    12, 14
../dist/Time-HiRes/t/alarm.t................................FAILED
    6, 9
    Non-zero exit status: 2

[perlio] -DDEBUGGING -Duseithreads -Uusemymalloc
../dist/threads/t/exit.t....................................FAILED
    14

Passed Todo tests: (common-args) none
[stdio/perlio] -Uusethreads -Uusemymalloc
[stdio/perlio] -DDEBUGGING -Uusethreads -Uusemymalloc
[stdio/perlio] -Duseithreads -Uusemymalloc
[stdio/perlio] -DDEBUGGING -Duseithreads -Uusemymalloc
../cpan/IO-Socket-IP/t/11sockopts.t.........................PASSED
    1-2

Compiler messages(gcc):
cygwin.c: In function ‘do_spawn’:
cygwin.c:114:5: warning: this ‘for’ clause does not guard.. [-Wmisleading-indentation]
const-c.inc: In function ‘_constant_5’:
const-c.inc:24:42: warning: unused parameter ‘iv_return’ [-Wunused-parameter]
POSIX.xs:1351:7: warning: ‘_tzname’ redeclared without dllimport attribute: previous dllimport ignored [-Wattributes]
POSIX.xs:1351:20: warning: initialization discards ‘const’ qualifier from pointer target type [-Wdiscarded-qualifiers]
POSIX.xs:1351:25: warning: initialization discards ‘const’ qualifier from pointer target type [-Wdiscarded-qualifiers]
POSIX.xs: In function ‘XS_POSIX_cuserid’:
POSIX.xs:3687:12: warning: implicit declaration of function ‘cuserid’ [-Wimplicit-function-declaration]
POSIX.xs:3687:10: warning: assignment makes pointer from integer without a cast [-Wint-conversion]
POSIX.xs: In function ‘my_rint’:
POSIX.xs:1082:1: warning: control reaches end of non-void function [-Wreturn-type]
./const-xs.inc: In function ‘boot_Socket’:
./const-xs.inc:980:43: warning: missing braces around initializer [-Wmissing-braces]
./const-xs.inc:989:43: warning: missing braces around initializer [-Wmissing-braces]
const-c.inc: In function ‘constant_19’:
const-c.inc:351:42: warning: unused parameter ‘iv_return’ [-Wunused-parameter]
Win32.xs:129:5: warning: non-local variable ‘g_osver’ with anonymous type is questionable in C++ [-Wc++-compat]
Win32.xs: In function ‘wstr_to_sv’:
Win32.xs:177:21: warning: implicit declaration of function ‘wcslen’ [-Wimplicit-function-declaration]
longpath.inc: In function ‘my_longpathW’:
Win32.xs:277:27: warning: implicit declaration of function ‘wcscpy’ [-Wimplicit-function-declaration]
Win32.xs: In function ‘free_childenv’:
Win32.xs:378:21: warning: unused parameter ‘d’ [-Wunused-parameter]
Win32.xs: In function ‘w32_IsAdminUser’:
Win32.xs:422:42: warning: missing braces around initializer [-Wmissing-braces]
Win32.xs: In function ‘w32_MsgBox’:
Win32.xs:699:23: warning: initialization discards ‘const’ qualifier from pointer target type [-Wdiscarded-qualifiers]
Win32.xs: In function ‘w32_GetArchName’:
../../XSUB.h:154:20: warning: unused variable ‘items’ [-Wunused-variable]
Win32.xs: In function ‘w32_GetChipName’:
Win32.xs: In function ‘w32_GuidGen’:
Win32.xs: In function ‘w32_GetFolderPath’:
Win32.xs:902:54: warning: assignment discards ‘const’ qualifier from pointer target type [-Wdiscarded-qualifiers]
Win32.xs:903:54: warning: assignment discards ‘const’ qualifier from pointer target type [-Wdiscarded-qualifiers]
Win32.xs:904:54: warning: assignment discards ‘const’ qualifier from pointer target type [-Wdiscarded-qualifiers]
Win32.xs:905:54: warning: assignment discards ‘const’ qualifier from pointer target type [-Wdiscarded-qualifiers]
Win32.xs:907:54: warning: assignment discards ‘const’ qualifier from pointer target type [-Wdiscarded-qualifiers]
Win32.xs:908:54: warning: assignment discards ‘const’ qualifier from pointer target type [-Wdiscarded-qualifiers]
Win32.xs:909:54: warning: assignment discards ‘const’ qualifier from pointer target type [-Wdiscarded-qualifiers]
Win32.xs:910:54: warning: assignment discards ‘const’ qualifier from pointer target type [-Wdiscarded-qualifiers]
Win32.xs:911:54: warning: assignment discards ‘const’ qualifier from pointer target type [-Wdiscarded-qualifiers]
Win32.xs:912:54: warning: assignment discards ‘const’ qualifier from pointer target type [-Wdiscarded-qualifiers]
Win32.xs:913:54: warning: assignment discards ‘const’ qualifier from pointer target type [-Wdiscarded-qualifiers]
Win32.xs:914:54: warning: assignment discards ‘const’ qualifier from pointer target type [-Wdiscarded-qualifiers]
Win32.xs:915:54: warning: assignment discards ‘const’ qualifier from pointer target type [-Wdiscarded-qualifiers]
Win32.xs:916:54: warning: assignment discards ‘const’ qualifier from pointer target type [-Wdiscarded-qualifiers]
Win32.xs:917:54: warning: assignment discards ‘const’ qualifier from pointer target type [-Wdiscarded-qualifiers]
Win32.xs:918:54: warning: assignment discards ‘const’ qualifier from pointer target type [-Wdiscarded-qualifiers]
Win32.xs:919:54: warning: assignment discards ‘const’ qualifier from pointer target type [-Wdiscarded-qualifiers]
Win32.xs:920:54: warning: assignment discards ‘const’ qualifier from pointer target type [-Wdiscarded-qualifiers]
Win32.xs:921:54: warning: assignment discards ‘const’ qualifier from pointer target type [-Wdiscarded-qualifiers]
Win32.xs:922:54: warning: assignment discards ‘const’ qualifier from pointer target type [-Wdiscarded-qualifiers]
Win32.xs:923:54: warning: assignment discards ‘const’ qualifier from pointer target type [-Wdiscarded-qualifiers]
Win32.xs:924:54: warning: assignment discards ‘const’ qualifier from pointer target type [-Wdiscarded-qualifiers]
Win32.xs:931:54: warning: assignment discards ‘const’ qualifier from pointer target type [-Wdiscarded-qualifiers]
Win32.xs:932:54: warning: assignment discards ‘const’ qualifier from pointer target type [-Wdiscarded-qualifiers]
Win32.xs:933:54: warning: assignment discards ‘const’ qualifier from pointer target type [-Wdiscarded-qualifiers]
Win32.xs:934:54: warning: assignment discards ‘const’ qualifier from pointer target type [-Wdiscarded-qualifiers]
Win32.xs:935:54: warning: assignment discards ‘const’ qualifier from pointer target type [-Wdiscarded-qualifiers]
Win32.xs:936:54: warning: assignment discards ‘const’ qualifier from pointer target type [-Wdiscarded-qualifiers]
Win32.xs:937:54: warning: assignment discards ‘const’ qualifier from pointer target type [-Wdiscarded-qualifiers]
Win32.xs:938:54: warning: assignment discards ‘const’ qualifier from pointer target type [-Wdiscarded-qualifiers]
Win32.xs:939:54: warning: assignment discards ‘const’ qualifier from pointer target type [-Wdiscarded-qualifiers]
Win32.xs:940:54: warning: assignment discards ‘const’ qualifier from pointer target type [-Wdiscarded-qualifiers]
Win32.xs:941:54: warning: assignment discards ‘const’ qualifier from pointer target type [-Wdiscarded-qualifiers]
Win32.xs:942:54: warning: assignment discards ‘const’ qualifier from pointer target type [-Wdiscarded-qualifiers]
Win32.xs:976:69: warning: passing argument 1 of ‘get_unicode_env’ discards ‘const’ qualifier from pointer target type [-Wdiscarded-qualifiers]
Win32.xs:977:69: warning: passing argument 1 of ‘get_unicode_env’ discards ‘const’ qualifier from pointer target type [-Wdiscarded-qualifiers]
Win32.xs:978:69: warning: passing argument 1 of ‘get_unicode_env’ discards ‘const’ qualifier from pointer target type [-Wdiscarded-qualifiers]
Win32.xs:979:69: warning: passing argument 1 of ‘get_unicode_env’ discards ‘const’ qualifier from pointer target type [-Wdiscarded-qualifiers]
Win32.xs:980:69: warning: passing argument 1 of ‘get_unicode_env’ discards ‘const’ qualifier from pointer target type [-Wdiscarded-qualifiers]
Win32.xs: In function ‘w32_SetChildShowWindow’:
Win32.xs: In function ‘w32_GetCwd’:
Win32.xs: In function ‘w32_GetNextAvailDrive’:
Win32.xs: In function ‘w32_GetLastError’:
Win32.xs: In function ‘w32_LoginName’:
Win32.xs: In function ‘w32_NodeName’:
Win32.xs: In function ‘w32_DomainName’:
Win32.xs: In function ‘w32_FsType’:
Win32.xs: In function ‘w32_GetOSVersion’:
Win32.xs: In function ‘w32_IsWinNT’:
Win32.xs: In function ‘w32_IsWin95’:
Win32.xs: In function ‘w32_GetTickCount’:
Win32.xs: In function ‘w32_GetLongPathName’:
Win32.xs:1528:26: warning: comparison between signed and unsigned integer expressions [-Wsign-compare]
Win32.xs: In function ‘w32_GetCurrentProcessId’:
Win32.xs: In function ‘w32_GetCurrentThreadId’:
Win32.xs: In function ‘w32_GetACP’:
Win32.xs: In function ‘w32_GetConsoleCP’:
Win32.xs: In function ‘w32_GetConsoleOutputCP’:
Win32.xs: In function ‘w32_GetOEMCP’:
Win32.xs: In function ‘boot_Win32’:
Win32.xs:1767:18: warning: initialization discards ‘const’ qualifier from pointer target type [-Wdiscarded-qualifiers]
Win32.xs:1189:16: warning: ‘pfnNetWkstaGetInfo’ may be used uninitialized in this function [-Wmaybe-uninitialized]
Win32.xs:1212:6: warning: ‘pfnNetApiBufferFree’ may be used uninitialized in this function [-Wmaybe-uninitialized]
longpath.inc:84:26: warning: array subscript is above array bounds [-Warray-bounds]
File.c: In function ‘XS_Win32API__File_GetVolumeInformationW’:
buffers.h:422:24: warning: implicit declaration of function ‘wcslen’ [-Wimplicit-function-declaration]
File.c: In function ‘XS_Win32API__File_OsFHandleOpenFd’:
File.c:1458:8: warning: variable ‘uMode’ set but not used [-Wunused-but-set-variable]
File.c:1457:7: warning: variable ‘hOsFHandle’ set but not used [-Wunused-but-set-variable]
File.xs: In function ‘XS_Win32API__File_SetFilePointer’:
File.xs:604:14: warning: comparison between signed and unsigned integer expressions [-Wsign-compare]
File.xs: In function ‘ErrPrintf’:
File.xs:65:7: warning: assignment discards ‘const’ qualifier from pointer target type [-Wdiscarded-qualifiers]
File.xs:58:5: warning: ‘ErrPrintf’ defined but not used [-Wunused-function]
Win32.xs:976:69: warning: passing argument 2 of ‘get_unicode_env’ discards ‘const’ qualifier from pointer target type [-Wdiscarded-qualifiers]
Win32.xs:977:69: warning: passing argument 2 of ‘get_unicode_env’ discards ‘const’ qualifier from pointer target type [-Wdiscarded-qualifiers]
Win32.xs:978:69: warning: passing argument 2 of ‘get_unicode_env’ discards ‘const’ qualifier from pointer target type [-Wdiscarded-qualifiers]
Win32.xs:979:69: warning: passing argument 2 of ‘get_unicode_env’ discards ‘const’ qualifier from pointer target type [-Wdiscarded-qualifiers]
Win32.xs:980:69: warning: passing argument 2 of ‘get_unicode_env’ discards ‘const’ qualifier from pointer target type [-Wdiscarded-qualifiers]
UUID: 2C292639-6CC4-1014-ABF9-368AACCF1AF9
Branch: blead
Config: default
Logs: http://perl.develop-help.com/reports/

-- 
Report by Test::Smoke v1.53 build  running on perl 5.26.1
(Reporter v0.050 / Smoker v0.045)



nntp.perl.org: Perl Programming lists via nntp and http.
Comments to Ask Bjørn Hansen at ask@perl.org | Group listing | About