develooper Front page | perl.daily-build.reports | Postings from February 2018

Smoke [smoke-me/khw-locale] v5.27.8-186-gbdb88ee8a4 FAIL(m) netbsd7.1.1 (amd64/1 cpu)

From:
Carlos Guevara
Date:
February 7, 2018 22:35
Subject:
Smoke [smoke-me/khw-locale] v5.27.8-186-gbdb88ee8a4 FAIL(m) netbsd7.1.1 (amd64/1 cpu)
Message ID:
20180207223529.DE25216C590@cjg-netbsd7
Automated smoke report for branch smoke-me/khw-locale 5.27.9 patch bdb88ee8a417b4dd17c7496144cbaa8ab8f2a25f v5.27.8-186-gbdb88ee8a4
cjg-netbsd7: Intel 686-class (amd64/1 cpu)
    on        netbsd - 7.1.1
    using     cc version 4.8.5
    smoketime 25 minutes 29 seconds (average 3 minutes 11.125 seconds)

Summary: FAIL(m)

O = OK  F = Failure(s), extended report at the bottom
X = Failure(s) under TEST but not under harness
? = still running or test results not (yet) available
Build failures during:       - = unknown or N/A
c = Configure, m = make, M = make (after miniperl), t = make test-prep

v5.27.8-186-gbdb88ee8a4  Configuration (common) none
----------- ---------------------------------------------------------
m m         
m m         -Duse64bitall
m m         -Duseithreads
m m         -Duseithreads -Duse64bitall
| +--------- -DDEBUGGING
+----------- no debugging


Locally applied patches:
    SMOKEbdb88ee8a417b4dd17c7496144cbaa8ab8f2a25f

Testsuite was run only with 'harness'

Tests skipped on user request:
    # One test name on a line
Compiler messages(gcc):
locale.c: In function 'S_new_numeric':
locale.c:1357:5: error: 'PL_underlying_numeric_obj' undeclared (first use in this function)
locale.c:1357:5: note: each undeclared identifier is reported only once for each function it appears in
locale.c: In function 'S_save_to_buffer':
locale.c:2178:5: error: 'PERL_ARGS_ASSERT_SAVE_TO_BUFFER' undeclared (first use in this function)
locale.c: In function 'S_my_nl_langinfo':
locale.c:2387:9: warning: implicit declaration of function 'save_to_buffer' [-Wimplicit-function-declaration]
locale.c: In function 'Perl__is_cur_LC_category_utf8':
locale.c:4359:17: warning: variable 'save_errno' set but not used [-Wunused-but-set-variable]
locale.c: In function 'Perl_sync_locale':
locale.c:5046:5: warning: implicit declaration of function 'uselocale' [-Wimplicit-function-declaration]
locale.c:5046:24: warning: initialization makes pointer from integer without a cast [enabled by default]
embedvar.h:343:40: error: 'PerlInterpreter' has no member named 'Iunderlying_numeric_obj'
locale.c:1357:5: note: in expansion of macro 'PL_underlying_numeric_obj'
locale.c:1359:43: note: in expansion of macro 'PL_underlying_numeric_obj'

Non-Fatal messages(gcc):



-- 
Report by Test::Smoke v1.71 running on perl 5.26.1
(Reporter v0.053 / Smoker v0.046)



nntp.perl.org: Perl Programming lists via nntp and http.
Comments to Ask Bjørn Hansen at ask@perl.org | Group listing | About