develooper Front page | perl.daily-build.reports | Postings from September 2017

Smoke [5.27.4] v5.27.3-92-gc2b4244a1c FAIL(F) openvms V8.4 (IA64/2cpu)

From:
Craig A. Berry
Date:
September 14, 2017 04:48
Subject:
Smoke [5.27.4] v5.27.3-92-gc2b4244a1c FAIL(F) openvms V8.4 (IA64/2cpu)
Message ID:
629416.61649117-sendEmail@alma
Automated smoke report for 5.27.4 patch c2b4244a1cd5bb89e0df552475efbb59ea37e706 v5.27.3-92-gc2b4244a1c
ALMA: HP rx2660  (1.67GHz/9.0MB) (IA64/2 cpu)
    on        openvms - V8.4
    using     HP C V7.3-020

    smoketime 2 hours 45 minutes (average 1 hour 22 minutes)

Summary: FAIL(F)

O = OK  F = Failure(s), extended report at the bottom
X = Failure(s) under TEST but not under harness
? = still running or test results not (yet) available
Build failures during:       - = unknown or N/A
c = Configure, m = make, M = make (after miniperl), t = make test-prep

v5.27.3-92-gc2b4244a1c  Configuration (common) none
----------- ---------------------------------------------------------
F -         
F -         -Duseithreads
| +--------- -DDEBUGGING
+----------- no debugging


Locally applied patches:
    SMOKEc2b4244a1cd5bb89e0df552475efbb59ea37e706

Failures: (common-args) none
[default] 
    t/run/switches ................................................. FAILED--unexpected output at test 126
    cpan/ExtUtils-MakeMaker/t/02-xsdynamic ......................... FAILED at test 64
    cpan/ExtUtils-MakeMaker/t/basic ................................ FAILED at test 176
    cpan/Test-Harness/t/proverun ................................... FAILED at test 3
    ext/XS-APItest/t/bootstrap ..................................... FAILED at test 1

[default] -Duseithreads
    t/run/switches ................................................. FAILED--unexpected output at test 120
    t/op/chdir ..................................................... FAILED at test 28
    cpan/ExtUtils-MakeMaker/t/02-xsdynamic ......................... FAILED at test 64
    cpan/ExtUtils-MakeMaker/t/basic ................................ FAILED at test 176
    cpan/Test-Harness/t/proverun ................................... FAILED at test 3
    ext/XS-APItest/t/bootstrap ..................................... FAILED at test 1

MANIFEST did not declare 'CPAN/PARENT/T/RT62341^.T.DISABLED'
MANIFEST declared 'CPAN/PARENT/T/RT62341_T.DISABLED' but it is missing
MANIFEST did not declare 'CPAN/^.DIR-LOCALS.EL'
MANIFEST declared 'CPAN/_DIR-LOCALS.EL' but it is missing
MANIFEST did not declare 'CROSS/MAKEFILE^.SH.PATCH'
MANIFEST declared 'CROSS/MAKEFILE_SH.PATCH' but it is missing
MANIFEST did not declare '^.DIR-LOCALS.EL'
MANIFEST did not declare '^.TRAVIS.YML'
MANIFEST declared '_DIR-LOCALS.EL' but it is missing
MANIFEST declared '_TRAVIS.YML' but it is missing

Compiler messages(VMS):

        return len - (STRLEN)(s->posn) <= 0;
..............^
%CC-I-QUESTCOMPARE, In this statement, the unsigned expression "len-(STRLEN)(s->posn)" is being compared with a relational operator to a constant whose value is not greater than zero.  This might not be what you intended.
at line number 25 in file SMOKE_BUILD_ROOT:[blead.ext.PerlIO-scalar]scalar.xs;1

-- 
Report by Test::Smoke v1.53 build 1374 running on perl 5.24.2
(Reporter v0.050 / Smoker v0.045)




nntp.perl.org: Perl Programming lists via nntp and http.
Comments to Ask Bjørn Hansen at ask@perl.org | Group listing | About