develooper Front page | perl.daily-build.reports | Postings from September 2017

Smoke [5.26.1] v5.26.1-RC1-3-g6122e27 FAIL(M) darwin 15.6.0 (IntelCore 2 Duo/)

Thread Next
From:
tony
Date:
September 13, 2017 10:46
Subject:
Smoke [5.26.1] v5.26.1-RC1-3-g6122e27 FAIL(M) darwin 15.6.0 (IntelCore 2 Duo/)
Message ID:
201709131046.v8DAk8KA026784@mars.tony.develop-help.com
Automated smoke report for 5.26.1 patch 6122e27d31818a50553c4c066c6e45a980391cb1 v5.26.1-RC1-3-g6122e27
neptune.local: iMac (2.4 GHz) (Intel Core 2 Duo/)
    on        darwin - 15.6.0 (Mac OS X)
    using     cc version 4.2.1 Compatible Apple LLVM 8.0.0 (clang-800.0.42.1)
    smoketime 1 hour 38 minutes (average 6 minutes 10 seconds)

Summary: FAIL(M)

O = OK  F = Failure(s), extended report at the bottom
X = Failure(s) under TEST but not under harness
? = still running or test results not (yet) available
Build failures during:       - = unknown or N/A
c = Configure, m = make, M = make (after miniperl), t = make test-prep

v5.26.1-RC1-3-g6122e27  Configuration (common) none
----------- ---------------------------------------------------------
M - M -     
M - M -     -Duse64bitint
M - M -     -Dusedtrace
M - M -     -Dusemorebits
M - M -     -Duseithreads
M - M -     -Duseithreads -Duse64bitint
M - M -     -Duseithreads -Dusedtrace
M - M -     -Duseithreads -Dusemorebits
| | | +----- PERLIO = perlio -DDEBUGGING
| | +------- PERLIO = stdio  -DDEBUGGING
| +--------- PERLIO = perlio
+----------- PERLIO = stdio


Locally applied patches:
    uncommitted-changes
    SMOKE6122e27d31818a50553c4c066c6e45a980391cb1

Testsuite was run only with 'harness' and HARNESS_OPTIONS=j3

Failures: (common-args) none
[minitest] 
[minitest] -DDEBUGGING
[minitest] -Duse64bitint
[minitest] -DDEBUGGING -Duse64bitint
[minitest] -Dusedtrace
[minitest] -DDEBUGGING -Dusedtrace
[minitest] -Dusemorebits
[minitest] -DDEBUGGING -Dusemorebits
[minitest] -Duseithreads
[minitest] -DDEBUGGING -Duseithreads
[minitest] -Duseithreads -Duse64bitint
[minitest] -DDEBUGGING -Duseithreads -Duse64bitint
[minitest] -Duseithreads -Dusedtrace
[minitest] -DDEBUGGING -Duseithreads -Dusedtrace
[minitest] -Duseithreads -Dusemorebits
[minitest] -DDEBUGGING -Duseithreads -Dusemorebits
    t/re/pat ....................... FAILED--no leader found
    t/re/reg_eval_scope ............ FAILED--no leader found
    t/re/regex_sets ................ FAILED--no leader found
    t/op/chdir ..................... FAILED--no leader found
    t/op/magic ..................... FAILED--expected 192 tests, saw 60
    t/op/pack ...................... FAILED--no leader found
    t/op/require_errors ............ FAILED--no leader found
    t/op/smartmatch ................ FAILED at test 350
    t/op/split_unicode ............. FAILED--no leader found
    t/op/tr ........................ FAILED--no leader found

-- 
Report by Test::Smoke v1.43 build 1271 running on perl 5.18.2
(Reporter v0.035 / Smoker v0.045)

Logs at http://perl.develop-help.com/reports/
Branch: remotes/origin/smoke-me/steveh/filepath
Configuration: default

Thread Next


nntp.perl.org: Perl Programming lists via nntp and http.
Comments to Ask Bjørn Hansen at ask@perl.org | Group listing | About