develooper Front page | perl.daily-build.reports | Postings from September 2017

Smoke [blead] v5.27.3-88-gd6150e1074 FAIL(F) HP-UX B.11.23/64(ia64/2 cpu)

Thread Next
From:
H.Merijn Brand
Date:
September 12, 2017 09:08
Subject:
Smoke [blead] v5.27.3-88-gd6150e1074 FAIL(F) HP-UX B.11.23/64(ia64/2 cpu)
Message ID:
MAILBE5B23AA@mail.procura.nl
Automated smoke report for branch blead 5.27.4 patch d6150e10749d85cf1797627bdf8cf9a86cd8d6e6 v5.27.3-88-gd6150e1074
x1: Intel(R) Itanium 2 processor/1600 MHz (ia64/2 cpu)
    on        HP-UX - B.11.23/64
    using     ccache cc version B3910B A.06.25.02
    smoketime 12 hours 22 minutes (average 1 hour 32 minutes)

Summary: FAIL(F)

O = OK  F = Failure(s), extended report at the bottom
X = Failure(s) under TEST but not under harness
? = still running or test results not (yet) available
Build failures during:       - = unknown or N/A
c = Configure, m = make, M = make (after miniperl), t = make test-prep

v5.27.3-88-gd6150e1074  Configuration (common) none
----------- ---------------------------------------------------------
O O O O O O 
O O O O O O -Duse64bitall
O O O O O O -Duseithreads
O O O F F F -Duseithreads -Duse64bitall
| | | | | +- LC_ALL = univ.utf8 -DDEBUGGING
| | | | +--- PERLIO = perlio -DDEBUGGING
| | | +----- PERLIO = stdio  -DDEBUGGING
| | +------- LC_ALL = univ.utf8
| +--------- PERLIO = perlio
+----------- PERLIO = stdio 

Locally applied patches:
    SMOKEd6150e10749d85cf1797627bdf8cf9a86cd8d6e6

Testsuite was run only with 'harness'

Tests skipped on user request:
    lib/Test/Simple/t/utf8.t
Failures: (common-args) none
[stdio] -DDEBUGGING -Duseithreads -Duse64bitall
../t/io/layers.t............................................FAILED
    Non-zero exit status: 1
    No plan found in TAP output
../t/re/fold_grind.t........................................FAILED
    Non-zero exit status: 1
    No plan found in TAP output
../t/re/pat.t...............................................FAILED
    802
../t/re/pat_re_eval.t.......................................FAILED
    Non-zero exit status: 1
    Bad plan.  You planned 497 tests but ran 290.
../t/re/pat_re_eval_thr.t...................................FAILED
    Non-zero exit status: 1
    Bad plan.  You planned 497 tests but ran 290.
../t/re/pat_rt_report.t.....................................FAILED
    2492
../t/re/pat_rt_report_thr.t.................................FAILED
    2492
../t/re/pat_thr.t...........................................FAILED
    802
../t/op/tr.t................................................FAILED
    Non-zero exit status: 1
    Bad plan.  You planned 216 tests but ran 157.
../t/op/threads.t...........................................FAILED
    30
../t/uni/gv.t...............................................FAILED
    Non-zero exit status: 1
    Bad plan.  You planned 206 tests but ran 77.
../t/uni/labels.t...........................................FAILED
    Non-zero exit status: 1
    Bad plan.  You planned 10 tests but ran 1.
../t/uni/method.t...........................................FAILED
    Non-zero exit status: 1
    Bad plan.  You planned 62 tests but ran 24.
../t/mro/package_aliases_utf8.t.............................FAILED
    11-34
../t/porting/regen.t........................................FAILED
    Non-zero exit status: 1
    Bad plan.  You planned 43 tests but ran 9.
../t/porting/podcheck.t.....................................FAILED
    Non-zero exit status: 1
    Bad plan.  You planned 1442 tests but ran 0.
../cpan/Archive-Tar/t/08_ptargrep.t.........................FAILED
    1
    Non-zero exit status: 1
../cpan/Archive-Tar/t/09_roundtrip.t........................FAILED
    Non-zero exit status: 1
    Bad plan.  You planned 7 tests but ran 3.
../cpan/autodie/t/utf8_open.t...............................FAILED
    Non-zero exit status: 1
    No plan found in TAP output
../cpan/CPAN-Meta-YAML/t/10_read.t..........................FAILED
    Non-zero exit status: 1
    No plan found in TAP output
../cpan/CPAN-Meta/t/converter.t.............................FAILED
    Non-zero exit status: 1
    No plan found in TAP output
../cpan/CPAN-Meta-YAML/t/12_write.t.........................FAILED
    Non-zero exit status: 1
    No plan found in TAP output
../cpan/CPAN-Meta/t/converter-bad.t.........................FAILED
    Non-zero exit status: 1
    No plan found in TAP output
../cpan/CPAN-Meta/t/converter-fail.t........................FAILED
    Non-zero exit status: 1
    No plan found in TAP output
../cpan/CPAN-Meta-YAML/t/21_yamlpm_compat.t.................FAILED
    Non-zero exit status: 1
    No plan found in TAP output
../cpan/CPAN-Meta/t/load-bad.t..............................FAILED
    Non-zero exit status: 1
    No plan found in TAP output
../cpan/CPAN-Meta-YAML/t/30_yaml_spec_tml.t.................FAILED
    Non-zero exit status: 1
    No plan found in TAP output
../cpan/CPAN-Meta-YAML/t/31_local_tml.t.....................FAILED
    Non-zero exit status: 1
    No plan found in TAP output
../cpan/CPAN-Meta-YAML/t/32_world_tml.t.....................FAILED
    Non-zero exit status: 1
    No plan found in TAP output
../cpan/CPAN-Meta/t/parse-cpan-meta/02_api.t................FAILED
    Non-zero exit status: 1
    No plan found in TAP output
../cpan/CPAN/t/01loadme.t...................................FAILED
    Non-zero exit status: 1
    Bad plan.  You planned 1 tests but ran 0.
../cpan/CPAN-Meta/t/save-load.t.............................FAILED
    Non-zero exit status: 1
    No plan found in TAP output
../cpan/CPAN/t/02nox.t......................................FAILED
    Non-zero exit status: 1
    Bad plan.  You planned 8 tests but ran 0.
../cpan/CPAN-Meta/t/validator.t.............................FAILED
    Non-zero exit status: 1
    No plan found in TAP output
../cpan/CPAN/t/03pkgs.t.....................................FAILED
    Non-zero exit status: 1
    Bad plan.  You planned 11 tests but ran 0.
../cpan/CPAN/t/11mirroredby.t...............................FAILED
    Non-zero exit status: 1
    Bad plan.  You planned 6 tests but ran 0.
../cpan/Digest-MD5/t/utf8.t.................................FAILED
    Non-zero exit status: 1
    Bad plan.  You planned 5 tests but ran 3.
../cpan/Encode/t/Aliases.t..................................FAILED
    Non-zero exit status: 1
    No plan found in TAP output
../cpan/Encode/t/at-cn.t....................................FAILED
    Non-zero exit status: 1
    Bad plan.  You planned 29 tests but ran 0.
../cpan/Encode/t/at-tw.t....................................FAILED
    Non-zero exit status: 1
    Bad plan.  You planned 17 tests but ran 0.
../cpan/Encode/t/CJKT.t.....................................FAILED
    Non-zero exit status: 1
    Bad plan.  You planned 60 tests but ran 0.
../cpan/Encode/t/cow.t......................................FAILED
    Non-zero exit status: 1
    No plan found in TAP output
../cpan/Encode/t/decode.t...................................FAILED
    Non-zero exit status: 1
    No plan found in TAP output
../cpan/Encode/t/Encode.t...................................FAILED
    Non-zero exit status: 1
    No plan found in TAP output
../cpan/Encode/t/Encoder.t..................................FAILED
    Non-zero exit status: 1
    Bad plan.  You planned 516 tests but ran 0.
../cpan/Encode/t/encoding-locale.t..........................FAILED
    Non-zero exit status: 1
    Bad plan.  You planned 3 tests but ran 0.
../cpan/Encode/t/fallback.t.................................FAILED
    Non-zero exit status: 1
    Bad plan.  You planned 58 tests but ran 0.
../cpan/Encode/t/from_to.t..................................FAILED
    Non-zero exit status: 1
    Bad plan.  You planned 3 tests but ran 0.
../cpan/Encode/t/grow.t.....................................FAILED
    Non-zero exit status: 1
    No plan found in TAP output
../cpan/Encode/t/gsm0338.t..................................FAILED
    Non-zero exit status: 1
    Bad plan.  You planned 780 tests but ran 0.
../cpan/Encode/t/guess.t....................................FAILED
    Non-zero exit status: 1
    No plan found in TAP output
../cpan/Encode/t/isa.t......................................FAILED
    Non-zero exit status: 1
    No plan found in TAP output
../cpan/Encode/t/jis7-fallback.t............................FAILED
    Non-zero exit status: 1
    No plan found in TAP output
../cpan/Encode/t/magic.t....................................FAILED
    Non-zero exit status: 1
    No plan found in TAP output
../cpan/Encode/t/mime-header.t..............................FAILED
    Non-zero exit status: 1
    Bad plan.  You planned 266 tests but ran 0.
../cpan/Encode/t/mime-name.t................................FAILED
    Non-zero exit status: 1
    No plan found in TAP output
../cpan/Encode/t/mime_header_iso2022jp.t....................FAILED
    Non-zero exit status: 1
    Bad plan.  You planned 14 tests but ran 0.
../cpan/Encode/t/perlio.t...................................FAILED
    Non-zero exit status: 1
    Bad plan.  You planned 38 tests but ran 0.
../cpan/Encode/t/rt113164.t.................................FAILED
    Non-zero exit status: 1
    Bad plan.  You planned 2 tests but ran 0.
../cpan/Encode/t/rt65541.t..................................FAILED
    Non-zero exit status: 1
    No plan found in TAP output
../cpan/Encode/t/rt76824.t..................................FAILED
    Non-zero exit status: 1
    No plan found in TAP output
../cpan/Encode/t/rt85489.t..................................FAILED
    Non-zero exit status: 1
    Bad plan.  You planned 8 tests but ran 0.
../cpan/Encode/t/rt86327.t..................................FAILED
    Non-zero exit status: 1
    No plan found in TAP output
../cpan/Encode/t/taint.t....................................FAILED
    Non-zero exit status: 1
    No plan found in TAP output
../cpan/Encode/t/truncated_utf8.t...........................FAILED
    Non-zero exit status: 1
    No plan found in TAP output
../cpan/Encode/t/undef.t....................................FAILED
    Non-zero exit status: 1
    No plan found in TAP output
../cpan/Encode/t/Unicode.t..................................FAILED
    Non-zero exit status: 1
    Bad plan.  You planned 56 tests but ran 0.
../cpan/Encode/t/use-Encode-Alias.t.........................FAILED
    Non-zero exit status: 1
    No plan found in TAP output
../cpan/Encode/t/utf8messages.t.............................FAILED
    Non-zero exit status: 1
    No plan found in TAP output
../cpan/Encode/t/utf8ref.t..................................FAILED
    Non-zero exit status: 1
    No plan found in TAP output
../cpan/Encode/t/utf8strict.t...............................FAILED
    Non-zero exit status: 1
    No plan found in TAP output
../cpan/Encode/t/utf8warnings.t.............................FAILED
    Non-zero exit status: 1
    No plan found in TAP output
../cpan/ExtUtils-Constant/t/Constant.t......................FAILED
    Non-zero exit status: 1
    No plan found in TAP output
../cpan/ExtUtils-Install/t/Install.t........................FAILED
    Non-zero exit status: 1
    Bad plan.  You planned 62 tests but ran 0.
../cpan/ExtUtils-Install/t/Installapi2.t....................FAILED
    Non-zero exit status: 1
    Bad plan.  You planned 70 tests but ran 0.
../cpan/ExtUtils-Install/t/Installed.t......................FAILED
    Non-zero exit status: 1
    Bad plan.  You planned 73 tests but ran 0.
../cpan/ExtUtils-Install/t/InstallWithMM.t..................FAILED
    Non-zero exit status: 1
    No plan found in TAP output
../cpan/ExtUtils-MakeMaker/t/02-xsdynamic.t.................FAILED
    Non-zero exit status: 1
    No plan found in TAP output
../cpan/ExtUtils-MakeMaker/t/03-xsstatic.t..................FAILED
    Non-zero exit status: 1
    No plan found in TAP output
../cpan/ExtUtils-MakeMaker/t/arch_check.t...................FAILED
    Non-zero exit status: 1
    No plan found in TAP output
../cpan/ExtUtils-MakeMaker/t/backwards.t....................FAILED
    Non-zero exit status: 1
    Bad plan.  You planned 2 tests but ran 0.
../cpan/ExtUtils-MakeMaker/t/basic.t........................FAILED
    Non-zero exit status: 1
    No plan found in TAP output
../cpan/ExtUtils-MakeMaker/t/build_man.t....................FAILED
    Non-zero exit status: 1
    Bad plan.  You planned 10 tests but ran 0.
../cpan/ExtUtils-MakeMaker/t/cd.t...........................FAILED
    Non-zero exit status: 1
    Bad plan.  You planned 4 tests but ran 0.
../cpan/ExtUtils-MakeMaker/t/dir_target.t...................FAILED
    Non-zero exit status: 1
    Bad plan.  You planned 1 tests but ran 0.
../cpan/ExtUtils-MakeMaker/t/echo.t.........................FAILED
    Non-zero exit status: 1
    No plan found in TAP output
../cpan/ExtUtils-MakeMaker/t/FIRST_MAKEFILE.t...............FAILED
    Non-zero exit status: 1
    Bad plan.  You planned 7 tests but ran 0.
../cpan/ExtUtils-MakeMaker/t/fix_libs.t.....................FAILED
    Non-zero exit status: 1
    No plan found in TAP output
../cpan/ExtUtils-MakeMaker/t/fixin.t........................FAILED
    Non-zero exit status: 1
    Bad plan.  You planned 22 tests but ran 0.
../cpan/ExtUtils-MakeMaker/t/hints.t........................FAILED
    Non-zero exit status: 1
    Bad plan.  You planned 3 tests but ran 0.
../cpan/ExtUtils-MakeMaker/t/INST.t.........................FAILED
    Non-zero exit status: 1
    Bad plan.  You planned 26 tests but ran 0.
../cpan/ExtUtils-MakeMaker/t/INST_PREFIX.t..................FAILED
    Non-zero exit status: 1
    Bad plan.  You planned 52 tests but ran 0.
../cpan/ExtUtils-MakeMaker/t/INSTALL_BASE.t.................FAILED
    Non-zero exit status: 1
    No plan found in TAP output
../cpan/ExtUtils-MakeMaker/t/installed_file.t...............FAILED
    Non-zero exit status: 1
    No plan found in TAP output
../cpan/ExtUtils-MakeMaker/t/is_of_type.t...................FAILED
    Non-zero exit status: 1
    No plan found in TAP output
../cpan/ExtUtils-MakeMaker/t/make.t.........................FAILED
    Non-zero exit status: 1
    Bad plan.  You planned 3 tests but ran 0.
../cpan/ExtUtils-MakeMaker/t/MakeMaker_Parameters.t.........FAILED
    Non-zero exit status: 1
    No plan found in TAP output
../cpan/ExtUtils-MakeMaker/t/maketext_filter.t..............FAILED
    Non-zero exit status: 1
    Bad plan.  You planned 6 tests but ran 0.
../cpan/ExtUtils-MakeMaker/t/meta_convert.t.................FAILED
    Non-zero exit status: 1
    No plan found in TAP output
../cpan/ExtUtils-MakeMaker/t/metafile_data.t................FAILED
    Non-zero exit status: 1
    No plan found in TAP output
../cpan/ExtUtils-MakeMaker/t/metafile_file.t................FAILED
    Non-zero exit status: 1
    Bad plan.  You planned 16 tests but ran 0.
../cpan/ExtUtils-MakeMaker/t/min_perl_version.t.............FAILED
    Non-zero exit status: 1
    No plan found in TAP output
../cpan/ExtUtils-MakeMaker/t/miniperl.t.....................FAILED
    3-4
    Non-zero exit status: 2
../cpan/ExtUtils-MakeMaker/t/MM_Any.t.......................FAILED
    Non-zero exit status: 1
    Bad plan.  You planned 7 tests but ran 0.
../cpan/ExtUtils-MakeMaker/t/MM_Unix.t......................FAILED
    Non-zero exit status: 1
    Bad plan.  You planned 110 tests but ran 0.
../cpan/ExtUtils-MakeMaker/t/oneliner.t.....................FAILED
    Non-zero exit status: 1
    No plan found in TAP output
../cpan/ExtUtils-MakeMaker/t/os_unsupported.t...............FAILED
    Non-zero exit status: 1
    Bad plan.  You planned 1 tests but ran 0.
../cpan/ExtUtils-MakeMaker/t/parse_abstract.t...............FAILED
    Non-zero exit status: 1
    No plan found in TAP output
../cpan/ExtUtils-MakeMaker/t/parse_version.t................FAILED
    Non-zero exit status: 1
    No plan found in TAP output
../cpan/ExtUtils-MakeMaker/t/PL_FILES.t.....................FAILED
    Non-zero exit status: 1
    No plan found in TAP output
../cpan/ExtUtils-MakeMaker/t/pm.t...........................FAILED
    Non-zero exit status: 1
    Bad plan.  You planned 6 tests but ran 0.
../cpan/ExtUtils-MakeMaker/t/pm_to_blib.t...................FAILED
    Non-zero exit status: 1
    No plan found in TAP output
../cpan/ExtUtils-MakeMaker/t/pod2man.t......................FAILED
    Non-zero exit status: 1
    Bad plan.  You planned 3 tests but ran 0.
../cpan/ExtUtils-MakeMaker/t/postamble.t....................FAILED
    Non-zero exit status: 1
    Bad plan.  You planned 8 tests but ran 0.
../cpan/ExtUtils-MakeMaker/t/prefixify.t....................FAILED
    Non-zero exit status: 1
    No plan found in TAP output
../cpan/ExtUtils-MakeMaker/t/prereq.t.......................FAILED
    Non-zero exit status: 1
    Bad plan.  You planned 21 tests but ran 0.
../cpan/ExtUtils-MakeMaker/t/prereq_print.t.................FAILED
    Non-zero exit status: 1
    No plan found in TAP output
../cpan/ExtUtils-MakeMaker/t/problems.t.....................FAILED
    Non-zero exit status: 1
    Bad plan.  You planned 5 tests but ran 0.
../cpan/ExtUtils-MakeMaker/t/prompt.t.......................FAILED
    Non-zero exit status: 1
    Bad plan.  You planned 11 tests but ran 0.
../cpan/ExtUtils-MakeMaker/t/recurs.t.......................FAILED
    Non-zero exit status: 1
    No plan found in TAP output
../cpan/ExtUtils-MakeMaker/t/revision.t.....................FAILED
    Non-zero exit status: 1
    Bad plan.  You planned 4 tests but ran 0.
../cpan/ExtUtils-MakeMaker/t/several_authors.t..............FAILED
    Non-zero exit status: 1
    No plan found in TAP output
../cpan/ExtUtils-MakeMaker/t/split_command.t................FAILED
    Non-zero exit status: 1
    No plan found in TAP output
../cpan/ExtUtils-MakeMaker/t/test_boilerplate.t.............FAILED
    Non-zero exit status: 1
    No plan found in TAP output
../cpan/ExtUtils-MakeMaker/t/unicode.t......................FAILED
    Non-zero exit status: 1
    No plan found in TAP output
../cpan/ExtUtils-MakeMaker/t/VERSION_FROM.t.................FAILED
    Non-zero exit status: 1
    Bad plan.  You planned 1 tests but ran 0.
../cpan/ExtUtils-MakeMaker/t/vstrings.t.....................FAILED
    Non-zero exit status: 1
    No plan found in TAP output
../cpan/ExtUtils-MakeMaker/t/WriteEmptyMakefile.t...........FAILED
    Non-zero exit status: 1
    Bad plan.  You planned 5 tests but ran 0.
../cpan/ExtUtils-MakeMaker/t/writemakefile_args.t...........FAILED
    Non-zero exit status: 1
    Bad plan.  You planned 43 tests but ran 0.
../cpan/IPC-Cmd/t/01_IPC-Cmd.t..............................FAILED
    Non-zero exit status: 1
    No plan found in TAP output
../cpan/IPC-Cmd/t/03_run-forked.t...........................FAILED
    Non-zero exit status: 1
    No plan found in TAP output
../cpan/JSON-PP/t/gh_28_json_test_suite.t...................FAILED
    Non-zero exit status: 1
    Bad plan.  You planned 20 tests but ran 14.
../cpan/IO-Compress/t/110encode-bzip2.t.....................FAILED
    Non-zero exit status: 1
    No plan found in TAP output
../cpan/IO-Compress/t/110encode-deflate.t...................FAILED
    Non-zero exit status: 1
    No plan found in TAP output
../cpan/IO-Compress/t/110encode-gzip.t......................FAILED
    Non-zero exit status: 1
    No plan found in TAP output
../cpan/IO-Compress/t/110encode-rawdeflate.t................FAILED
    Non-zero exit status: 1
    No plan found in TAP output
../cpan/IO-Compress/t/110encode-zip.t.......................FAILED
    Non-zero exit status: 1
    No plan found in TAP output
../cpan/IO-Compress/t/cz-08encoding.t.......................FAILED
    Non-zero exit status: 1
    No plan found in TAP output
../cpan/Module-Metadata/t/encoding.t........................FAILED
    Non-zero exit status: 1
    Bad plan.  You planned 12 tests but ran 0.
../cpan/Pod-Checker/t/pod/podchkenc.t.......................FAILED
    Non-zero exit status: 1
    Bad plan.  You planned 1 tests but ran 0.
../cpan/Pod-Perldoc/t/00_load.t.............................FAILED
    Non-zero exit status: 1
    Bad plan.  You planned 12 tests but ran 0.
../cpan/Pod-Perldoc/t/man/_get_columns.t....................FAILED
    Non-zero exit status: 1
    No plan found in TAP output
../cpan/Pod-Simple/t/00about.t..............................FAILED
    Non-zero exit status: 1
    Bad plan.  You planned 27 tests but ran 24.
../cpan/Pod-Simple/t/corpus.t...............................FAILED
    Non-zero exit status: 1
    Bad plan.  You planned 61 tests but ran 1.
../cpan/Pod-Usage/t/pod/headwithmarkup.t....................FAILED
    1
    Non-zero exit status: 1
../cpan/Pod-Simple/t/enc-chars.t............................FAILED
    Non-zero exit status: 1
    Bad plan.  You planned 5 tests but ran 3.
../cpan/Pod-Usage/t/pod/pod2usage2.t........................FAILED
    Non-zero exit status: 1
    Bad plan.  You planned 33 tests but ran 0.
../cpan/Pod-Simple/t/encod01.t..............................FAILED
    Non-zero exit status: 1
    Bad plan.  You planned 6 tests but ran 0.
../cpan/Pod-Simple/t/encod02.t..............................FAILED
    Non-zero exit status: 1
    Bad plan.  You planned 4 tests but ran 1.
../cpan/Pod-Usage/t/pod/selectheaders.t.....................FAILED
    1-2
    Non-zero exit status: 2
../cpan/Pod-Simple/t/encod03.t..............................FAILED
    Non-zero exit status: 1
    Bad plan.  You planned 4 tests but ran 1.
../cpan/Pod-Usage/t/pod/selectsections.t....................FAILED
    1-2
    Non-zero exit status: 2
../cpan/Pod-Simple/t/encod04.t..............................FAILED
    Non-zero exit status: 1
    Bad plan.  You planned 5 tests but ran 1.
../cpan/podlators/t/general/basic.t.........................FAILED
    Non-zero exit status: 1
    Bad plan.  You planned 15 tests but ran 0.
../cpan/podlators/t/general/filehandle.t....................FAILED
    Non-zero exit status: 1
    Bad plan.  You planned 4 tests but ran 0.
../cpan/podlators/t/general/pod-parser.t....................FAILED
    Non-zero exit status: 1
    Bad plan.  You planned 7 tests but ran 0.
../cpan/podlators/t/man/devise-date.t.......................FAILED
    Non-zero exit status: 1
    No plan found in TAP output
../cpan/podlators/t/man/devise-title.t......................FAILED
    Non-zero exit status: 1
    Bad plan.  You planned 5 tests but ran 0.
../cpan/podlators/t/man/empty.t.............................FAILED
    Non-zero exit status: 1
    Bad plan.  You planned 8 tests but ran 0.
../cpan/podlators/t/man/heading.t...........................FAILED
    Non-zero exit status: 1
    Bad plan.  You planned 9 tests but ran 0.
../cpan/podlators/t/man/iso-8859-1.t........................FAILED
    Non-zero exit status: 1
    Bad plan.  You planned 3 tests but ran 0.
../cpan/podlators/t/man/snippets.t..........................FAILED
    Non-zero exit status: 1
    Bad plan.  You planned 93 tests but ran 0.
../cpan/podlators/t/man/utf8-io.t...........................FAILED
    Non-zero exit status: 1
    No plan found in TAP output
../cpan/Pod-Simple/t/htmlbat.t..............................FAILED
    Non-zero exit status: 1
    Bad plan.  You planned 17 tests but ran 2.
../cpan/podlators/t/text/basic.t............................FAILED
    Non-zero exit status: 1
    Bad plan.  You planned 9 tests but ran 0.
../cpan/podlators/t/text/color.t............................FAILED
    Non-zero exit status: 1
    Bad plan.  You planned 4 tests but ran 0.
../cpan/podlators/t/text/empty.t............................FAILED
    Non-zero exit status: 1
    Bad plan.  You planned 8 tests but ran 0.
../cpan/podlators/t/text/encoding.t.........................FAILED
    Non-zero exit status: 1
    Bad plan.  You planned 7 tests but ran 0.
../cpan/podlators/t/text/options.t..........................FAILED
    Non-zero exit status: 1
    Bad plan.  You planned 37 tests but ran 0.
../cpan/podlators/t/text/overstrike.t.......................FAILED
    Non-zero exit status: 1
    Bad plan.  You planned 4 tests but ran 0.
../cpan/podlators/t/text/perlio.t...........................FAILED
    Non-zero exit status: 1
    Bad plan.  You planned 4 tests but ran 0.
../cpan/podlators/t/text/termcap.t..........................FAILED
    Non-zero exit status: 1
    Bad plan.  You planned 4 tests but ran 0.
../cpan/podlators/t/text/utf8.t.............................FAILED
    Non-zero exit status: 1
    Bad plan.  You planned 4 tests but ran 0.
../cpan/Pod-Simple/t/pulltitl.t.............................FAILED
    Non-zero exit status: 1
    Bad plan.  You planned 117 tests but ran 69.
../cpan/Pod-Simple/t/xhtml01.t..............................FAILED
    Non-zero exit status: 1
    Bad plan.  You planned 62 tests but ran 40.
../cpan/Test-Harness/t/unicode.t............................FAILED
    Non-zero exit status: 1
    No plan found in TAP output
../cpan/Test-Simple/t/Legacy/utf8.t.........................FAILED
    Non-zero exit status: 1
    No plan found in TAP output
../dist/Data-Dumper/t/bugs.t................................FAILED
    Non-zero exit status: 1
    Bad plan.  You planned 24 tests but ran 6.
../dist/encoding-warnings/t/1-warning.t.....................FAILED
    Non-zero exit status: 1
    No plan found in TAP output
../ext/PerlIO-encoding/t/encoding.t.........................FAILED
    Non-zero exit status: 1
    No plan found in TAP output
../ext/PerlIO-encoding/t/fallback.t.........................FAILED
    Non-zero exit status: 1
    No plan found in TAP output
../ext/PerlIO-encoding/t/nolooping.t........................FAILED
    Non-zero exit status: 1
    Bad plan.  You planned 1 tests but ran 0.
../ext/PerlIO-encoding/t/threads.t..........................FAILED
    Non-zero exit status: 1
    Bad plan.  You planned 4 tests but ran 0.
../ext/XS-APItest/t/fetch_pad_names.t.......................FAILED
    Non-zero exit status: 1
    No plan found in TAP output
../ext/XS-APItest/t/utf16_to_utf8.t.........................FAILED
    Non-zero exit status: 1
    No plan found in TAP output
../lib/DBM_Filter/t/encode.t................................FAILED
    Non-zero exit status: 1
    No plan found in TAP output
../lib/DBM_Filter/t/utf8.t..................................FAILED
    Non-zero exit status: 1
    No plan found in TAP output
../lib/ExtUtils/t/Embed.t...................................FAILED
    Non-zero exit status: 1
    Bad plan.  You planned 10 tests but ran 0.
../lib/open.t...............................................FAILED
    Non-zero exit status: 1
    Bad plan.  You planned 23 tests but ran 21.
../lib/Pod/t/Usage.t........................................FAILED
    Non-zero exit status: 1
    Bad plan.  You planned 8 tests but ran 0.

[perlio] -DDEBUGGING -Duseithreads -Duse64bitall
../t/io/layers.t............................................FAILED
    Non-zero exit status: 1
    No plan found in TAP output
../t/re/fold_grind.t........................................FAILED
    Non-zero exit status: 1
    No plan found in TAP output
../t/re/pat.t...............................................FAILED
    802
../t/re/pat_thr.t...........................................FAILED
    802
../t/re/pat_rt_report.t.....................................FAILED
    2492
../t/re/pat_rt_report_thr.t.................................FAILED
    2492
../t/re/pat_re_eval_thr.t...................................FAILED
    Non-zero exit status: 1
    Bad plan.  You planned 497 tests but ran 290.
../t/re/pat_re_eval.t.......................................FAILED
    Non-zero exit status: 1
    Bad plan.  You planned 497 tests but ran 290.
../t/op/threads.t...........................................FAILED
    30
../t/op/tr.t................................................FAILED
    Non-zero exit status: 1
    Bad plan.  You planned 216 tests but ran 157.
../t/uni/gv.t...............................................FAILED
    Non-zero exit status: 1
    Bad plan.  You planned 206 tests but ran 77.
../t/uni/method.t...........................................FAILED
    Non-zero exit status: 1
    Bad plan.  You planned 62 tests but ran 24.
../t/uni/labels.t...........................................FAILED
    Non-zero exit status: 1
    No plan found in TAP output
../t/mro/package_aliases_utf8.t.............................FAILED
    11-34
../t/porting/regen.t........................................FAILED
    Non-zero exit status: 1
    Bad plan.  You planned 43 tests but ran 9.
../t/porting/podcheck.t.....................................FAILED
    Non-zero exit status: 1
    No plan found in TAP output
../cpan/IO-Compress/t/110encode-bzip2.t.....................FAILED
    Non-zero exit status: 1
    No plan found in TAP output
../cpan/IO-Compress/t/110encode-deflate.t...................FAILED
    Non-zero exit status: 1
    No plan found in TAP output
../cpan/IO-Compress/t/110encode-gzip.t......................FAILED
    Non-zero exit status: 1
    No plan found in TAP output
../cpan/IO-Compress/t/110encode-rawdeflate.t................FAILED
    Non-zero exit status: 1
    No plan found in TAP output
../cpan/IO-Compress/t/110encode-zip.t.......................FAILED
    Non-zero exit status: 1
    No plan found in TAP output
../cpan/IO-Compress/t/cz-08encoding.t.......................FAILED
    Non-zero exit status: 1
    No plan found in TAP output
../cpan/Pod-Simple/t/00about.t..............................FAILED
    Non-zero exit status: 1
    Bad plan.  You planned 27 tests but ran 24.
../cpan/Pod-Simple/t/corpus.t...............................FAILED
    Non-zero exit status: 1
    Bad plan.  You planned 61 tests but ran 1.
../cpan/Pod-Simple/t/enc-chars.t............................FAILED
    Non-zero exit status: 1
    Bad plan.  You planned 5 tests but ran 3.
../cpan/Pod-Simple/t/encod01.t..............................FAILED
    Non-zero exit status: 1
    Bad plan.  You planned 6 tests but ran 0.
../cpan/Pod-Simple/t/encod02.t..............................FAILED
    Non-zero exit status: 1
    Bad plan.  You planned 4 tests but ran 1.
../cpan/Pod-Simple/t/encod03.t..............................FAILED
    Non-zero exit status: 1
    Bad plan.  You planned 4 tests but ran 1.
../cpan/Pod-Simple/t/encod04.t..............................FAILED
    Non-zero exit status: 1
    Bad plan.  You planned 5 tests but ran 1.
../cpan/Pod-Simple/t/htmlbat.t..............................FAILED
    Non-zero exit status: 1
    Bad plan.  You planned 17 tests but ran 2.
../cpan/Pod-Simple/t/pulltitl.t.............................FAILED
    Non-zero exit status: 1
    Bad plan.  You planned 117 tests but ran 69.
../cpan/Pod-Simple/t/xhtml01.t..............................FAILED
    Non-zero exit status: 1
    Bad plan.  You planned 62 tests but ran 40.
../cpan/Test-Harness/t/unicode.t............................FAILED
    Non-zero exit status: 1
    No plan found in TAP output
../cpan/JSON-PP/t/gh_28_json_test_suite.t...................FAILED
    Non-zero exit status: 1
    Bad plan.  You planned 20 tests but ran 14.
../cpan/Test-Simple/t/Legacy/utf8.t.........................FAILED
    Non-zero exit status: 1
    No plan found in TAP output
../cpan/ExtUtils-MakeMaker/t/02-xsdynamic.t.................FAILED
    Non-zero exit status: 1
    No plan found in TAP output
../cpan/ExtUtils-MakeMaker/t/03-xsstatic.t..................FAILED
    Non-zero exit status: 1
    No plan found in TAP output
../cpan/ExtUtils-MakeMaker/t/arch_check.t...................FAILED
    Non-zero exit status: 1
    No plan found in TAP output
../cpan/ExtUtils-MakeMaker/t/backwards.t....................FAILED
    Non-zero exit status: 1
    Bad plan.  You planned 2 tests but ran 0.
../cpan/ExtUtils-MakeMaker/t/basic.t........................FAILED
    Non-zero exit status: 1
    No plan found in TAP output
../cpan/ExtUtils-MakeMaker/t/build_man.t....................FAILED
    Non-zero exit status: 1
    Bad plan.  You planned 10 tests but ran 0.
../cpan/ExtUtils-MakeMaker/t/cd.t...........................FAILED
    Non-zero exit status: 1
    Bad plan.  You planned 4 tests but ran 0.
../cpan/ExtUtils-MakeMaker/t/dir_target.t...................FAILED
    Non-zero exit status: 1
    Bad plan.  You planned 1 tests but ran 0.
../cpan/ExtUtils-MakeMaker/t/echo.t.........................FAILED
    Non-zero exit status: 1
    No plan found in TAP output
../cpan/ExtUtils-MakeMaker/t/FIRST_MAKEFILE.t...............FAILED
    Non-zero exit status: 1
    Bad plan.  You planned 7 tests but ran 0.
../cpan/ExtUtils-MakeMaker/t/fix_libs.t.....................FAILED
    Non-zero exit status: 1
    No plan found in TAP output
../cpan/ExtUtils-MakeMaker/t/fixin.t........................FAILED
    Non-zero exit status: 1
    Bad plan.  You planned 22 tests but ran 0.
../cpan/ExtUtils-MakeMaker/t/hints.t........................FAILED
    Non-zero exit status: 1
    Bad plan.  You planned 3 tests but ran 0.
../cpan/ExtUtils-MakeMaker/t/INST.t.........................FAILED
    Non-zero exit status: 1
    Bad plan.  You planned 26 tests but ran 0.
../cpan/ExtUtils-MakeMaker/t/INST_PREFIX.t..................FAILED
    Non-zero exit status: 1
    Bad plan.  You planned 52 tests but ran 0.
../cpan/ExtUtils-MakeMaker/t/INSTALL_BASE.t.................FAILED
    Non-zero exit status: 1
    No plan found in TAP output
../cpan/ExtUtils-MakeMaker/t/installed_file.t...............FAILED
    Non-zero exit status: 1
    No plan found in TAP output
../cpan/ExtUtils-MakeMaker/t/is_of_type.t...................FAILED
    Non-zero exit status: 1
    No plan found in TAP output
../cpan/ExtUtils-MakeMaker/t/make.t.........................FAILED
    Non-zero exit status: 1
    Bad plan.  You planned 3 tests but ran 0.
../cpan/ExtUtils-MakeMaker/t/MakeMaker_Parameters.t.........FAILED
    Non-zero exit status: 1
    No plan found in TAP output
../cpan/ExtUtils-MakeMaker/t/maketext_filter.t..............FAILED
    Non-zero exit status: 1
    Bad plan.  You planned 6 tests but ran 0.
../cpan/ExtUtils-MakeMaker/t/meta_convert.t.................FAILED
    Non-zero exit status: 1
    No plan found in TAP output
../cpan/ExtUtils-MakeMaker/t/metafile_data.t................FAILED
    Non-zero exit status: 1
    No plan found in TAP output
../cpan/ExtUtils-MakeMaker/t/metafile_file.t................FAILED
    Non-zero exit status: 1
    Bad plan.  You planned 16 tests but ran 0.
../cpan/ExtUtils-MakeMaker/t/min_perl_version.t.............FAILED
    Non-zero exit status: 1
    No plan found in TAP output
../cpan/ExtUtils-MakeMaker/t/miniperl.t.....................FAILED
    3-4
    Non-zero exit status: 2
../cpan/ExtUtils-MakeMaker/t/MM_Any.t.......................FAILED
    Non-zero exit status: 1
    Bad plan.  You planned 7 tests but ran 0.
../cpan/ExtUtils-MakeMaker/t/MM_Unix.t......................FAILED
    Non-zero exit status: 1
    Bad plan.  You planned 110 tests but ran 0.
../cpan/ExtUtils-MakeMaker/t/oneliner.t.....................FAILED
    Non-zero exit status: 1
    No plan found in TAP output
../cpan/ExtUtils-MakeMaker/t/os_unsupported.t...............FAILED
    Non-zero exit status: 1
    Bad plan.  You planned 1 tests but ran 0.
../cpan/ExtUtils-MakeMaker/t/parse_abstract.t...............FAILED
    Non-zero exit status: 1
    No plan found in TAP output
../cpan/ExtUtils-MakeMaker/t/parse_version.t................FAILED
    Non-zero exit status: 1
    No plan found in TAP output
../cpan/ExtUtils-MakeMaker/t/PL_FILES.t.....................FAILED
    Non-zero exit status: 1
    No plan found in TAP output
../cpan/ExtUtils-MakeMaker/t/pm.t...........................FAILED
    Non-zero exit status: 1
    Bad plan.  You planned 6 tests but ran 0.
../cpan/ExtUtils-MakeMaker/t/pm_to_blib.t...................FAILED
    Non-zero exit status: 1
    No plan found in TAP output
../cpan/ExtUtils-MakeMaker/t/pod2man.t......................FAILED
    Non-zero exit status: 1
    Bad plan.  You planned 3 tests but ran 0.
../cpan/ExtUtils-MakeMaker/t/postamble.t....................FAILED
    Non-zero exit status: 1
    Bad plan.  You planned 8 tests but ran 0.
../cpan/ExtUtils-MakeMaker/t/prefixify.t....................FAILED
    Non-zero exit status: 1
    No plan found in TAP output
../cpan/ExtUtils-MakeMaker/t/prereq.t.......................FAILED
    Non-zero exit status: 1
    Bad plan.  You planned 21 tests but ran 0.
../cpan/ExtUtils-MakeMaker/t/prereq_print.t.................FAILED
    Non-zero exit status: 1
    No plan found in TAP output
../cpan/ExtUtils-MakeMaker/t/problems.t.....................FAILED
    Non-zero exit status: 1
    Bad plan.  You planned 5 tests but ran 0.
../cpan/ExtUtils-MakeMaker/t/prompt.t.......................FAILED
    Non-zero exit status: 1
    Bad plan.  You planned 11 tests but ran 0.
../cpan/ExtUtils-MakeMaker/t/recurs.t.......................FAILED
    Non-zero exit status: 1
    No plan found in TAP output
../cpan/ExtUtils-MakeMaker/t/revision.t.....................FAILED
    Non-zero exit status: 1
    Bad plan.  You planned 4 tests but ran 0.
../cpan/ExtUtils-MakeMaker/t/several_authors.t..............FAILED
    Non-zero exit status: 1
    No plan found in TAP output
../cpan/ExtUtils-MakeMaker/t/split_command.t................FAILED
    Non-zero exit status: 1
    No plan found in TAP output
../cpan/ExtUtils-MakeMaker/t/test_boilerplate.t.............FAILED
    Non-zero exit status: 1
    No plan found in TAP output
../cpan/ExtUtils-MakeMaker/t/unicode.t......................FAILED
    Non-zero exit status: 1
    No plan found in TAP output
../cpan/ExtUtils-MakeMaker/t/VERSION_FROM.t.................FAILED
    Non-zero exit status: 1
    Bad plan.  You planned 1 tests but ran 0.
../cpan/ExtUtils-MakeMaker/t/vstrings.t.....................FAILED
    Non-zero exit status: 1
    No plan found in TAP output
../cpan/ExtUtils-MakeMaker/t/WriteEmptyMakefile.t...........FAILED
    Non-zero exit status: 1
    Bad plan.  You planned 5 tests but ran 0.
../cpan/ExtUtils-MakeMaker/t/writemakefile_args.t...........FAILED
    Non-zero exit status: 1
    Bad plan.  You planned 43 tests but ran 0.
../cpan/Archive-Tar/t/08_ptargrep.t.........................FAILED
    1
    Non-zero exit status: 1
../cpan/Archive-Tar/t/09_roundtrip.t........................FAILED
    Non-zero exit status: 1
    Bad plan.  You planned 7 tests but ran 3.
../cpan/autodie/t/utf8_open.t...............................FAILED
    Non-zero exit status: 1
    No plan found in TAP output
../cpan/CPAN/t/01loadme.t...................................FAILED
    Non-zero exit status: 1
    No plan found in TAP output
../cpan/CPAN/t/02nox.t......................................FAILED
    Non-zero exit status: 1
    Bad plan.  You planned 8 tests but ran 0.
../cpan/CPAN/t/03pkgs.t.....................................FAILED
    Non-zero exit status: 1
    Bad plan.  You planned 11 tests but ran 0.
../cpan/CPAN/t/11mirroredby.t...............................FAILED
    Non-zero exit status: 1
    Bad plan.  You planned 6 tests but ran 0.
../dist/Data-Dumper/t/bugs.t................................FAILED
    Non-zero exit status: 1
    Bad plan.  You planned 24 tests but ran 6.
../cpan/Module-Metadata/t/encoding.t........................FAILED
    Non-zero exit status: 1
    Bad plan.  You planned 12 tests but ran 0.
../lib/DBM_Filter/t/encode.t................................FAILED
    Non-zero exit status: 1
    No plan found in TAP output
../lib/DBM_Filter/t/utf8.t..................................FAILED
    Non-zero exit status: 1
    No plan found in TAP output
../cpan/ExtUtils-Install/t/Install.t........................FAILED
    Non-zero exit status: 1
    Bad plan.  You planned 62 tests but ran 0.
../cpan/ExtUtils-Install/t/Installapi2.t....................FAILED
    Non-zero exit status: 1
    Bad plan.  You planned 70 tests but ran 0.
../cpan/ExtUtils-Install/t/Installed.t......................FAILED
    Non-zero exit status: 1
    Bad plan.  You planned 73 tests but ran 0.
../cpan/Pod-Usage/t/pod/headwithmarkup.t....................FAILED
    1
    Non-zero exit status: 1
../cpan/ExtUtils-Install/t/InstallWithMM.t..................FAILED
    Non-zero exit status: 1
    No plan found in TAP output
../cpan/Pod-Usage/t/pod/pod2usage2.t........................FAILED
    Non-zero exit status: 1
    Bad plan.  You planned 33 tests but ran 0.
../cpan/Pod-Usage/t/pod/selectheaders.t.....................FAILED
    1-2
    Non-zero exit status: 2
../cpan/Pod-Usage/t/pod/selectsections.t....................FAILED
    1-2
    Non-zero exit status: 2
../cpan/podlators/t/man/devise-date.t.......................FAILED
    Non-zero exit status: 1
    No plan found in TAP output
../cpan/podlators/t/man/devise-title.t......................FAILED
    Non-zero exit status: 1
    Bad plan.  You planned 5 tests but ran 0.
../cpan/podlators/t/man/empty.t.............................FAILED
    Non-zero exit status: 1
    Bad plan.  You planned 8 tests but ran 0.
../cpan/podlators/t/man/heading.t...........................FAILED
    Non-zero exit status: 1
    Bad plan.  You planned 9 tests but ran 0.
../cpan/podlators/t/man/iso-8859-1.t........................FAILED
    Non-zero exit status: 1
    Bad plan.  You planned 3 tests but ran 0.
../cpan/podlators/t/man/snippets.t..........................FAILED
    Non-zero exit status: 1
    Bad plan.  You planned 93 tests but ran 0.
../cpan/podlators/t/man/utf8-io.t...........................FAILED
    Non-zero exit status: 1
    No plan found in TAP output
../cpan/IPC-Cmd/t/01_IPC-Cmd.t..............................FAILED
    Non-zero exit status: 1
    No plan found in TAP output
../cpan/IPC-Cmd/t/03_run-forked.t...........................FAILED
    Non-zero exit status: 1
    No plan found in TAP output
../cpan/CPAN-Meta/t/converter.t.............................FAILED
    Non-zero exit status: 1
    No plan found in TAP output
../cpan/CPAN-Meta/t/converter-bad.t.........................FAILED
    Non-zero exit status: 1
    No plan found in TAP output
../cpan/CPAN-Meta/t/converter-fail.t........................FAILED
    Non-zero exit status: 1
    No plan found in TAP output
../cpan/CPAN-Meta/t/load-bad.t..............................FAILED
    Non-zero exit status: 1
    No plan found in TAP output
../cpan/CPAN-Meta/t/save-load.t.............................FAILED
    Non-zero exit status: 1
    No plan found in TAP output
../cpan/CPAN-Meta/t/validator.t.............................FAILED
    Non-zero exit status: 1
    No plan found in TAP output
../cpan/CPAN-Meta-YAML/t/10_read.t..........................FAILED
    Non-zero exit status: 1
    No plan found in TAP output
../cpan/CPAN-Meta-YAML/t/12_write.t.........................FAILED
    Non-zero exit status: 1
    No plan found in TAP output
../cpan/CPAN-Meta-YAML/t/21_yamlpm_compat.t.................FAILED
    Non-zero exit status: 1
    No plan found in TAP output
../cpan/CPAN-Meta-YAML/t/30_yaml_spec_tml.t.................FAILED
    Non-zero exit status: 1
    No plan found in TAP output
../cpan/CPAN-Meta-YAML/t/31_local_tml.t.....................FAILED
    Non-zero exit status: 1
    No plan found in TAP output
../cpan/CPAN-Meta-YAML/t/32_world_tml.t.....................FAILED
    Non-zero exit status: 1
    No plan found in TAP output
../lib/Pod/t/Usage.t........................................FAILED
    Non-zero exit status: 1
    Bad plan.  You planned 8 tests but ran 0.
../lib/ExtUtils/t/Embed.t...................................FAILED
    Non-zero exit status: 1
    Bad plan.  You planned 10 tests but ran 0.
../cpan/Digest-MD5/t/utf8.t.................................FAILED
    Non-zero exit status: 1
    No plan found in TAP output
../cpan/CPAN-Meta/t/parse-cpan-meta/02_api.t................FAILED
    Non-zero exit status: 1
    No plan found in TAP output
../cpan/Pod-Checker/t/pod/podchkenc.t.......................FAILED
    Non-zero exit status: 1
    No plan found in TAP output
../cpan/Pod-Perldoc/t/00_load.t.............................FAILED
    Non-zero exit status: 1
    Bad plan.  You planned 12 tests but ran 0.
../cpan/Encode/t/Aliases.t..................................FAILED
    Non-zero exit status: 1
    No plan found in TAP output
../cpan/Encode/t/at-cn.t....................................FAILED
    Non-zero exit status: 1
    Bad plan.  You planned 29 tests but ran 0.
../cpan/Encode/t/at-tw.t....................................FAILED
    Non-zero exit status: 1
    Bad plan.  You planned 17 tests but ran 0.
../cpan/Encode/t/CJKT.t.....................................FAILED
    Non-zero exit status: 1
    Bad plan.  You planned 60 tests but ran 0.
../cpan/Encode/t/cow.t......................................FAILED
    Non-zero exit status: 1
    No plan found in TAP output
../cpan/Encode/t/decode.t...................................FAILED
    Non-zero exit status: 1
    No plan found in TAP output
../cpan/Encode/t/Encode.t...................................FAILED
    Non-zero exit status: 1
    No plan found in TAP output
../cpan/podlators/t/text/basic.t............................FAILED
    Non-zero exit status: 1
    Bad plan.  You planned 9 tests but ran 0.
../cpan/Encode/t/Encoder.t..................................FAILED
    Non-zero exit status: 1
    Bad plan.  You planned 516 tests but ran 0.
../cpan/podlators/t/text/color.t............................FAILED
    Non-zero exit status: 1
    Bad plan.  You planned 4 tests but ran 0.
../cpan/Encode/t/encoding-locale.t..........................FAILED
    Non-zero exit status: 1
    Bad plan.  You planned 3 tests but ran 0.
../cpan/podlators/t/text/empty.t............................FAILED
    Non-zero exit status: 1
    Bad plan.  You planned 8 tests but ran 0.
../cpan/Encode/t/fallback.t.................................FAILED
    Non-zero exit status: 1
    Bad plan.  You planned 58 tests but ran 0.
../cpan/podlators/t/text/encoding.t.........................FAILED
    Non-zero exit status: 1
    Bad plan.  You planned 7 tests but ran 0.
../cpan/Encode/t/from_to.t..................................FAILED
    Non-zero exit status: 1
    Bad plan.  You planned 3 tests but ran 0.
../cpan/Encode/t/grow.t.....................................FAILED
    Non-zero exit status: 1
    No plan found in TAP output
../cpan/podlators/t/text/options.t..........................FAILED
    Non-zero exit status: 1
    Bad plan.  You planned 37 tests but ran 0.
../cpan/Encode/t/gsm0338.t..................................FAILED
    Non-zero exit status: 1
    Bad plan.  You planned 780 tests but ran 0.
../cpan/podlators/t/text/overstrike.t.......................FAILED
    Non-zero exit status: 1
    Bad plan.  You planned 4 tests but ran 0.
../cpan/Encode/t/guess.t....................................FAILED
    Non-zero exit status: 1
    No plan found in TAP output
../cpan/Encode/t/isa.t......................................FAILED
    Non-zero exit status: 1
    No plan found in TAP output
../cpan/podlators/t/text/perlio.t...........................FAILED
    Non-zero exit status: 1
    Bad plan.  You planned 4 tests but ran 0.
../cpan/Encode/t/jis7-fallback.t............................FAILED
    Non-zero exit status: 1
    No plan found in TAP output
../cpan/podlators/t/text/termcap.t..........................FAILED
    Non-zero exit status: 1
    Bad plan.  You planned 4 tests but ran 0.
../cpan/Encode/t/magic.t....................................FAILED
    Non-zero exit status: 1
    No plan found in TAP output
../cpan/podlators/t/text/utf8.t.............................FAILED
    Non-zero exit status: 1
    Bad plan.  You planned 4 tests but ran 0.
../cpan/Encode/t/mime-header.t..............................FAILED
    Non-zero exit status: 1
    Bad plan.  You planned 266 tests but ran 0.
../cpan/Encode/t/mime-name.t................................FAILED
    Non-zero exit status: 1
    No plan found in TAP output
../cpan/Encode/t/mime_header_iso2022jp.t....................FAILED
    Non-zero exit status: 1
    Bad plan.  You planned 14 tests but ran 0.
../cpan/Encode/t/perlio.t...................................FAILED
    Non-zero exit status: 1
    Bad plan.  You planned 38 tests but ran 0.
../cpan/Encode/t/rt113164.t.................................FAILED
    Non-zero exit status: 1
    Bad plan.  You planned 2 tests but ran 0.
../cpan/Encode/t/rt65541.t..................................FAILED
    Non-zero exit status: 1
    No plan found in TAP output
../cpan/Encode/t/rt76824.t..................................FAILED
    Non-zero exit status: 1
    No plan found in TAP output
../cpan/Encode/t/rt85489.t..................................FAILED
    Non-zero exit status: 1
    Bad plan.  You planned 8 tests but ran 0.
../cpan/Encode/t/rt86327.t..................................FAILED
    Non-zero exit status: 1
    No plan found in TAP output
../cpan/Encode/t/taint.t....................................FAILED
    Non-zero exit status: 1
    No plan found in TAP output
../cpan/Encode/t/truncated_utf8.t...........................FAILED
    Non-zero exit status: 1
    No plan found in TAP output
../cpan/Encode/t/undef.t....................................FAILED
    Non-zero exit status: 1
    No plan found in TAP output
../cpan/Encode/t/Unicode.t..................................FAILED
    Non-zero exit status: 1
    Bad plan.  You planned 56 tests but ran 0.
../cpan/Encode/t/use-Encode-Alias.t.........................FAILED
    Non-zero exit status: 1
    No plan found in TAP output
../cpan/Encode/t/utf8messages.t.............................FAILED
    Non-zero exit status: 1
    No plan found in TAP output
../cpan/Encode/t/utf8ref.t..................................FAILED
    Non-zero exit status: 1
    No plan found in TAP output
../cpan/Encode/t/utf8strict.t...............................FAILED
    Non-zero exit status: 1
    No plan found in TAP output
../cpan/Encode/t/utf8warnings.t.............................FAILED
    Non-zero exit status: 1
    No plan found in TAP output
../ext/PerlIO-encoding/t/encoding.t.........................FAILED
    Non-zero exit status: 1
    No plan found in TAP output
../ext/PerlIO-encoding/t/fallback.t.........................FAILED
    Non-zero exit status: 1
    No plan found in TAP output
../ext/PerlIO-encoding/t/nolooping.t........................FAILED
    Non-zero exit status: 1
    Bad plan.  You planned 1 tests but ran 0.
../ext/PerlIO-encoding/t/threads.t..........................FAILED
    Non-zero exit status: 1
    Bad plan.  You planned 4 tests but ran 0.
../cpan/podlators/t/general/basic.t.........................FAILED
    Non-zero exit status: 1
    Bad plan.  You planned 15 tests but ran 0.
../cpan/podlators/t/general/filehandle.t....................FAILED
    Non-zero exit status: 1
    Bad plan.  You planned 4 tests but ran 0.
../cpan/podlators/t/general/pod-parser.t....................FAILED
    Non-zero exit status: 1
    Bad plan.  You planned 7 tests but ran 0.
../lib/open.t...............................................FAILED
    Non-zero exit status: 1
    No plan found in TAP output
../dist/encoding-warnings/t/1-warning.t.....................FAILED
    Non-zero exit status: 1
    No plan found in TAP output
../ext/XS-APItest/t/fetch_pad_names.t.......................FAILED
    Non-zero exit status: 1
    No plan found in TAP output
../cpan/ExtUtils-Constant/t/Constant.t......................FAILED
    Non-zero exit status: 1
    No plan found in TAP output
../cpan/Pod-Perldoc/t/man/_get_columns.t....................FAILED
    Non-zero exit status: 1
    No plan found in TAP output
../ext/XS-APItest/t/utf16_to_utf8.t.........................FAILED
    Non-zero exit status: 1
    No plan found in TAP output

[univ.utf8] -DDEBUGGING -Duseithreads -Duse64bitall
../t/io/layers.t............................................FAILED
    Non-zero exit status: 1
    No plan found in TAP output
../t/re/fold_grind.t........................................FAILED
    Non-zero exit status: 1
    No plan found in TAP output
../t/re/pat_thr.t...........................................FAILED
    802
../t/re/pat.t...............................................FAILED
    802
../t/re/pat_rt_report.t.....................................FAILED
    2492
../t/re/pat_rt_report_thr.t.................................FAILED
    2492
../t/re/pat_re_eval.t.......................................FAILED
    Non-zero exit status: 1
    Bad plan.  You planned 497 tests but ran 290.
../t/re/pat_re_eval_thr.t...................................FAILED
    Non-zero exit status: 1
    Bad plan.  You planned 497 tests but ran 290.
../t/op/threads.t...........................................FAILED
    30
../t/op/tr.t................................................FAILED
    Non-zero exit status: 1
    Bad plan.  You planned 216 tests but ran 157.
../t/uni/gv.t...............................................FAILED
    Non-zero exit status: 1
    Bad plan.  You planned 206 tests but ran 77.
../t/uni/method.t...........................................FAILED
    Non-zero exit status: 1
    Bad plan.  You planned 62 tests but ran 24.
../t/uni/labels.t...........................................FAILED
    Non-zero exit status: 1
    No plan found in TAP output
../t/mro/package_aliases_utf8.t.............................FAILED
    11-34
../t/porting/regen.t........................................FAILED
    Non-zero exit status: 1
    Bad plan.  You planned 43 tests but ran 9.
../t/porting/podcheck.t.....................................FAILED
    Non-zero exit status: 1
    No plan found in TAP output
../cpan/IO-Compress/t/110encode-bzip2.t.....................FAILED
    Non-zero exit status: 1
    No plan found in TAP output
../cpan/IO-Compress/t/110encode-deflate.t...................FAILED
    Non-zero exit status: 1
    No plan found in TAP output
../cpan/IO-Compress/t/110encode-gzip.t......................FAILED
    Non-zero exit status: 1
    No plan found in TAP output
../cpan/IO-Compress/t/110encode-rawdeflate.t................FAILED
    Non-zero exit status: 1
    No plan found in TAP output
../cpan/IO-Compress/t/110encode-zip.t.......................FAILED
    Non-zero exit status: 1
    No plan found in TAP output
../cpan/IO-Compress/t/cz-08encoding.t.......................FAILED
    Non-zero exit status: 1
    No plan found in TAP output
../cpan/JSON-PP/t/gh_28_json_test_suite.t...................FAILED
    Non-zero exit status: 1
    Bad plan.  You planned 20 tests but ran 14.
../cpan/Pod-Simple/t/00about.t..............................FAILED
    Non-zero exit status: 1
    Bad plan.  You planned 27 tests but ran 24.
../cpan/Pod-Simple/t/corpus.t...............................FAILED
    Non-zero exit status: 1
    Bad plan.  You planned 61 tests but ran 1.
../cpan/Pod-Simple/t/enc-chars.t............................FAILED
    Non-zero exit status: 1
    Bad plan.  You planned 5 tests but ran 3.
../cpan/Pod-Simple/t/encod01.t..............................FAILED
    Non-zero exit status: 1
    Bad plan.  You planned 6 tests but ran 0.
../cpan/Pod-Simple/t/encod02.t..............................FAILED
    Non-zero exit status: 1
    Bad plan.  You planned 4 tests but ran 1.
../cpan/Pod-Simple/t/encod03.t..............................FAILED
    Non-zero exit status: 1
    Bad plan.  You planned 4 tests but ran 1.
../cpan/Pod-Simple/t/encod04.t..............................FAILED
    Non-zero exit status: 1
    Bad plan.  You planned 5 tests but ran 1.
../cpan/Pod-Simple/t/htmlbat.t..............................FAILED
    Non-zero exit status: 1
    Bad plan.  You planned 17 tests but ran 2.
../cpan/Pod-Simple/t/pulltitl.t.............................FAILED
    Non-zero exit status: 1
    Bad plan.  You planned 117 tests but ran 69.
../cpan/Pod-Simple/t/xhtml01.t..............................FAILED
    Non-zero exit status: 1
    Bad plan.  You planned 62 tests but ran 40.
../cpan/Test-Simple/t/Legacy/utf8.t.........................FAILED
    Non-zero exit status: 1
    No plan found in TAP output
../cpan/ExtUtils-MakeMaker/t/02-xsdynamic.t.................FAILED
    Non-zero exit status: 1
    No plan found in TAP output
../cpan/ExtUtils-MakeMaker/t/03-xsstatic.t..................FAILED
    Non-zero exit status: 1
    No plan found in TAP output
../cpan/ExtUtils-MakeMaker/t/arch_check.t...................FAILED
    Non-zero exit status: 1
    No plan found in TAP output
../cpan/ExtUtils-MakeMaker/t/backwards.t....................FAILED
    Non-zero exit status: 1
    Bad plan.  You planned 2 tests but ran 0.
../cpan/ExtUtils-MakeMaker/t/basic.t........................FAILED
    Non-zero exit status: 1
    No plan found in TAP output
../cpan/ExtUtils-MakeMaker/t/build_man.t....................FAILED
    Non-zero exit status: 1
    Bad plan.  You planned 10 tests but ran 0.
../cpan/ExtUtils-MakeMaker/t/cd.t...........................FAILED
    Non-zero exit status: 1
    Bad plan.  You planned 4 tests but ran 0.
../cpan/ExtUtils-MakeMaker/t/dir_target.t...................FAILED
    Non-zero exit status: 1
    Bad plan.  You planned 1 tests but ran 0.
../cpan/ExtUtils-MakeMaker/t/echo.t.........................FAILED
    Non-zero exit status: 1
    No plan found in TAP output
../cpan/ExtUtils-MakeMaker/t/FIRST_MAKEFILE.t...............FAILED
    Non-zero exit status: 1
    Bad plan.  You planned 7 tests but ran 0.
../cpan/ExtUtils-MakeMaker/t/fix_libs.t.....................FAILED
    Non-zero exit status: 1
    No plan found in TAP output
../cpan/ExtUtils-MakeMaker/t/fixin.t........................FAILED
    Non-zero exit status: 1
    Bad plan.  You planned 22 tests but ran 0.
../cpan/ExtUtils-MakeMaker/t/hints.t........................FAILED
    Non-zero exit status: 1
    Bad plan.  You planned 3 tests but ran 0.
../cpan/ExtUtils-MakeMaker/t/INST.t.........................FAILED
    Non-zero exit status: 1
    Bad plan.  You planned 26 tests but ran 0.
../cpan/ExtUtils-MakeMaker/t/INST_PREFIX.t..................FAILED
    Non-zero exit status: 1
    Bad plan.  You planned 52 tests but ran 0.
../cpan/ExtUtils-MakeMaker/t/INSTALL_BASE.t.................FAILED
    Non-zero exit status: 1
    No plan found in TAP output
../cpan/ExtUtils-MakeMaker/t/installed_file.t...............FAILED
    Non-zero exit status: 1
    No plan found in TAP output
../cpan/ExtUtils-MakeMaker/t/is_of_type.t...................FAILED
    Non-zero exit status: 1
    No plan found in TAP output
../cpan/ExtUtils-MakeMaker/t/make.t.........................FAILED
    Non-zero exit status: 1
    Bad plan.  You planned 3 tests but ran 0.
../cpan/ExtUtils-MakeMaker/t/MakeMaker_Parameters.t.........FAILED
    Non-zero exit status: 1
    No plan found in TAP output
../cpan/ExtUtils-MakeMaker/t/maketext_filter.t..............FAILED
    Non-zero exit status: 1
    Bad plan.  You planned 6 tests but ran 0.
../cpan/ExtUtils-MakeMaker/t/meta_convert.t.................FAILED
    Non-zero exit status: 1
    No plan found in TAP output
../cpan/ExtUtils-MakeMaker/t/metafile_data.t................FAILED
    Non-zero exit status: 1
    No plan found in TAP output
../cpan/ExtUtils-MakeMaker/t/metafile_file.t................FAILED
    Non-zero exit status: 1
    Bad plan.  You planned 16 tests but ran 0.
../cpan/ExtUtils-MakeMaker/t/min_perl_version.t.............FAILED
    Non-zero exit status: 1
    No plan found in TAP output
../cpan/ExtUtils-MakeMaker/t/miniperl.t.....................FAILED
    3-4
    Non-zero exit status: 2
../cpan/ExtUtils-MakeMaker/t/MM_Any.t.......................FAILED
    Non-zero exit status: 1
    Bad plan.  You planned 7 tests but ran 0.
../cpan/ExtUtils-MakeMaker/t/MM_Unix.t......................FAILED
    Non-zero exit status: 1
    Bad plan.  You planned 110 tests but ran 0.
../cpan/ExtUtils-MakeMaker/t/oneliner.t.....................FAILED
    Non-zero exit status: 1
    No plan found in TAP output
../cpan/ExtUtils-MakeMaker/t/os_unsupported.t...............FAILED
    Non-zero exit status: 1
    Bad plan.  You planned 1 tests but ran 0.
../cpan/ExtUtils-MakeMaker/t/parse_abstract.t...............FAILED
    Non-zero exit status: 1
    No plan found in TAP output
../cpan/ExtUtils-MakeMaker/t/parse_version.t................FAILED
    Non-zero exit status: 1
    No plan found in TAP output
../cpan/ExtUtils-MakeMaker/t/PL_FILES.t.....................FAILED
    Non-zero exit status: 1
    No plan found in TAP output
../cpan/ExtUtils-MakeMaker/t/pm.t...........................FAILED
    Non-zero exit status: 1
    Bad plan.  You planned 6 tests but ran 0.
../cpan/ExtUtils-MakeMaker/t/pm_to_blib.t...................FAILED
    Non-zero exit status: 1
    No plan found in TAP output
../cpan/ExtUtils-MakeMaker/t/pod2man.t......................FAILED
    Non-zero exit status: 1
    Bad plan.  You planned 3 tests but ran 0.
../cpan/ExtUtils-MakeMaker/t/postamble.t....................FAILED
    Non-zero exit status: 1
    Bad plan.  You planned 8 tests but ran 0.
../cpan/ExtUtils-MakeMaker/t/prefixify.t....................FAILED
    Non-zero exit status: 1
    No plan found in TAP output
../cpan/ExtUtils-MakeMaker/t/prereq.t.......................FAILED
    Non-zero exit status: 1
    Bad plan.  You planned 21 tests but ran 0.
../cpan/ExtUtils-MakeMaker/t/prereq_print.t.................FAILED
    Non-zero exit status: 1
    No plan found in TAP output
../cpan/ExtUtils-MakeMaker/t/problems.t.....................FAILED
    Non-zero exit status: 1
    Bad plan.  You planned 5 tests but ran 0.
../cpan/ExtUtils-MakeMaker/t/prompt.t.......................FAILED
    Non-zero exit status: 1
    Bad plan.  You planned 11 tests but ran 0.
../cpan/ExtUtils-MakeMaker/t/recurs.t.......................FAILED
    Non-zero exit status: 1
    No plan found in TAP output
../cpan/ExtUtils-MakeMaker/t/revision.t.....................FAILED
    Non-zero exit status: 1
    Bad plan.  You planned 4 tests but ran 0.
../cpan/ExtUtils-MakeMaker/t/several_authors.t..............FAILED
    Non-zero exit status: 1
    No plan found in TAP output
../cpan/ExtUtils-MakeMaker/t/split_command.t................FAILED
    Non-zero exit status: 1
    No plan found in TAP output
../cpan/ExtUtils-MakeMaker/t/test_boilerplate.t.............FAILED
    Non-zero exit status: 1
    No plan found in TAP output
../cpan/ExtUtils-MakeMaker/t/unicode.t......................FAILED
    Non-zero exit status: 1
    No plan found in TAP output
../cpan/ExtUtils-MakeMaker/t/VERSION_FROM.t.................FAILED
    Non-zero exit status: 1
    Bad plan.  You planned 1 tests but ran 0.
../cpan/ExtUtils-MakeMaker/t/vstrings.t.....................FAILED
    Non-zero exit status: 1
    No plan found in TAP output
../cpan/ExtUtils-MakeMaker/t/WriteEmptyMakefile.t...........FAILED
    Non-zero exit status: 1
    Bad plan.  You planned 5 tests but ran 0.
../cpan/ExtUtils-MakeMaker/t/writemakefile_args.t...........FAILED
    Non-zero exit status: 1
    Bad plan.  You planned 43 tests but ran 0.
../cpan/Archive-Tar/t/08_ptargrep.t.........................FAILED
    1
    Non-zero exit status: 1
../cpan/Archive-Tar/t/09_roundtrip.t........................FAILED
    Non-zero exit status: 1
    Bad plan.  You planned 7 tests but ran 3.
../cpan/autodie/t/utf8_open.t...............................FAILED
    Non-zero exit status: 1
    No plan found in TAP output
../dist/Data-Dumper/t/bugs.t................................FAILED
    Non-zero exit status: 1
    Bad plan.  You planned 24 tests but ran 6.
../cpan/Module-Metadata/t/encoding.t........................FAILED
    Non-zero exit status: 1
    Bad plan.  You planned 12 tests but ran 0.
../cpan/CPAN/t/01loadme.t...................................FAILED
    Non-zero exit status: 1
    No plan found in TAP output
../cpan/CPAN/t/02nox.t......................................FAILED
    Non-zero exit status: 1
    Bad plan.  You planned 8 tests but ran 0.
../cpan/CPAN/t/03pkgs.t.....................................FAILED
    Non-zero exit status: 1
    Bad plan.  You planned 11 tests but ran 0.
../cpan/CPAN/t/11mirroredby.t...............................FAILED
    Non-zero exit status: 1
    Bad plan.  You planned 6 tests but ran 0.
../lib/DBM_Filter/t/encode.t................................FAILED
    Non-zero exit status: 1
    No plan found in TAP output
../lib/DBM_Filter/t/utf8.t..................................FAILED
    Non-zero exit status: 1
    No plan found in TAP output
../cpan/Pod-Usage/t/pod/headwithmarkup.t....................FAILED
    1
    Non-zero exit status: 1
../cpan/Pod-Usage/t/pod/pod2usage2.t........................FAILED
    Non-zero exit status: 1
    Bad plan.  You planned 33 tests but ran 0.
../cpan/Pod-Usage/t/pod/selectheaders.t.....................FAILED
    1-2
    Non-zero exit status: 2
../cpan/Pod-Usage/t/pod/selectsections.t....................FAILED
    1-2
    Non-zero exit status: 2
../cpan/CPAN-Meta/t/converter.t.............................FAILED
    Non-zero exit status: 1
    No plan found in TAP output
../cpan/CPAN-Meta/t/converter-bad.t.........................FAILED
    Non-zero exit status: 1
    No plan found in TAP output
../cpan/CPAN-Meta/t/converter-fail.t........................FAILED
    Non-zero exit status: 1
    No plan found in TAP output
../cpan/CPAN-Meta/t/load-bad.t..............................FAILED
    Non-zero exit status: 1
    No plan found in TAP output
../cpan/CPAN-Meta/t/save-load.t.............................FAILED
    Non-zero exit status: 1
    No plan found in TAP output
../cpan/CPAN-Meta/t/validator.t.............................FAILED
    Non-zero exit status: 1
    No plan found in TAP output
../cpan/ExtUtils-Install/t/Install.t........................FAILED
    Non-zero exit status: 1
    Bad plan.  You planned 62 tests but ran 0.
../cpan/ExtUtils-Install/t/Installapi2.t....................FAILED
    Non-zero exit status: 1
    Bad plan.  You planned 70 tests but ran 0.
../cpan/ExtUtils-Install/t/Installed.t......................FAILED
    Non-zero exit status: 1
    Bad plan.  You planned 73 tests but ran 0.
../cpan/ExtUtils-Install/t/InstallWithMM.t..................FAILED
    Non-zero exit status: 1
    No plan found in TAP output
../cpan/podlators/t/man/devise-date.t.......................FAILED
    Non-zero exit status: 1
    No plan found in TAP output
../cpan/podlators/t/man/devise-title.t......................FAILED
    Non-zero exit status: 1
    Bad plan.  You planned 5 tests but ran 0.
../cpan/podlators/t/man/empty.t.............................FAILED
    Non-zero exit status: 1
    Bad plan.  You planned 8 tests but ran 0.
../cpan/podlators/t/man/heading.t...........................FAILED
    Non-zero exit status: 1
    Bad plan.  You planned 9 tests but ran 0.
../cpan/podlators/t/man/iso-8859-1.t........................FAILED
    Non-zero exit status: 1
    Bad plan.  You planned 3 tests but ran 0.
../cpan/podlators/t/man/snippets.t..........................FAILED
    Non-zero exit status: 1
    Bad plan.  You planned 93 tests but ran 0.
../cpan/podlators/t/man/utf8-io.t...........................FAILED
    Non-zero exit status: 1
    No plan found in TAP output
../cpan/CPAN-Meta-YAML/t/10_read.t..........................FAILED
    Non-zero exit status: 1
    No plan found in TAP output
../cpan/IPC-Cmd/t/01_IPC-Cmd.t..............................FAILED
    Non-zero exit status: 1
    No plan found in TAP output
../cpan/CPAN-Meta-YAML/t/12_write.t.........................FAILED
    Non-zero exit status: 1
    No plan found in TAP output
../cpan/IPC-Cmd/t/03_run-forked.t...........................FAILED
    Non-zero exit status: 1
    No plan found in TAP output
../cpan/CPAN-Meta-YAML/t/21_yamlpm_compat.t.................FAILED
    Non-zero exit status: 1
    No plan found in TAP output
../cpan/CPAN-Meta-YAML/t/30_yaml_spec_tml.t.................FAILED
    Non-zero exit status: 1
    No plan found in TAP output
../cpan/CPAN-Meta-YAML/t/31_local_tml.t.....................FAILED
    Non-zero exit status: 1
    No plan found in TAP output
../cpan/CPAN-Meta-YAML/t/32_world_tml.t.....................FAILED
    Non-zero exit status: 1
    No plan found in TAP output
../lib/Pod/t/Usage.t........................................FAILED
    Non-zero exit status: 1
    Bad plan.  You planned 8 tests but ran 0.
../cpan/Digest-MD5/t/utf8.t.................................FAILED
    Non-zero exit status: 1
    No plan found in TAP output
../lib/ExtUtils/t/Embed.t...................................FAILED
    Non-zero exit status: 1
    Bad plan.  You planned 10 tests but ran 0.
../cpan/Pod-Checker/t/pod/podchkenc.t.......................FAILED
    Non-zero exit status: 1
    No plan found in TAP output
../cpan/CPAN-Meta/t/parse-cpan-meta/02_api.t................FAILED
    Non-zero exit status: 1
    No plan found in TAP output
../cpan/Encode/t/Aliases.t..................................FAILED
    Non-zero exit status: 1
    No plan found in TAP output
../cpan/Encode/t/at-cn.t....................................FAILED
    Non-zero exit status: 1
    Bad plan.  You planned 29 tests but ran 0.
../cpan/Encode/t/at-tw.t....................................FAILED
    Non-zero exit status: 1
    Bad plan.  You planned 17 tests but ran 0.
../cpan/Encode/t/CJKT.t.....................................FAILED
    Non-zero exit status: 1
    Bad plan.  You planned 60 tests but ran 0.
../cpan/Encode/t/cow.t......................................FAILED
    Non-zero exit status: 1
    No plan found in TAP output
../cpan/Encode/t/decode.t...................................FAILED
    Non-zero exit status: 1
    No plan found in TAP output
../cpan/Encode/t/Encode.t...................................FAILED
    Non-zero exit status: 1
    No plan found in TAP output
../cpan/Encode/t/Encoder.t..................................FAILED
    Non-zero exit status: 1
    Bad plan.  You planned 516 tests but ran 0.
../cpan/Encode/t/encoding-locale.t..........................FAILED
    Non-zero exit status: 1
    Bad plan.  You planned 3 tests but ran 0.
../cpan/Encode/t/fallback.t.................................FAILED
    Non-zero exit status: 1
    Bad plan.  You planned 58 tests but ran 0.
../cpan/Encode/t/from_to.t..................................FAILED
    Non-zero exit status: 1
    Bad plan.  You planned 3 tests but ran 0.
../cpan/Encode/t/grow.t.....................................FAILED
    Non-zero exit status: 1
    No plan found in TAP output
../cpan/Encode/t/gsm0338.t..................................FAILED
    Non-zero exit status: 1
    Bad plan.  You planned 780 tests but ran 0.
../cpan/Encode/t/guess.t....................................FAILED
    Non-zero exit status: 1
    No plan found in TAP output
../cpan/Encode/t/isa.t......................................FAILED
    Non-zero exit status: 1
    No plan found in TAP output
../cpan/Encode/t/jis7-fallback.t............................FAILED
    Non-zero exit status: 1
    No plan found in TAP output
../cpan/Encode/t/magic.t....................................FAILED
    Non-zero exit status: 1
    No plan found in TAP output
../cpan/Encode/t/mime-header.t..............................FAILED
    Non-zero exit status: 1
    Bad plan.  You planned 266 tests but ran 0.
../cpan/Encode/t/mime-name.t................................FAILED
    Non-zero exit status: 1
    No plan found in TAP output
../cpan/Encode/t/mime_header_iso2022jp.t....................FAILED
    Non-zero exit status: 1
    Bad plan.  You planned 14 tests but ran 0.
../cpan/Encode/t/perlio.t...................................FAILED
    Non-zero exit status: 1
    Bad plan.  You planned 38 tests but ran 0.
../cpan/Encode/t/rt113164.t.................................FAILED
    Non-zero exit status: 1
    Bad plan.  You planned 2 tests but ran 0.
../cpan/Encode/t/rt65541.t..................................FAILED
    Non-zero exit status: 1
    No plan found in TAP output
../cpan/Encode/t/rt76824.t..................................FAILED
    Non-zero exit status: 1
    No plan found in TAP output
../cpan/Encode/t/rt85489.t..................................FAILED
    Non-zero exit status: 1
    Bad plan.  You planned 8 tests but ran 0.
../cpan/Encode/t/rt86327.t..................................FAILED
    Non-zero exit status: 1
    No plan found in TAP output
../cpan/Encode/t/taint.t....................................FAILED
    Non-zero exit status: 1
    No plan found in TAP output
../cpan/Encode/t/truncated_utf8.t...........................FAILED
    Non-zero exit status: 1
    No plan found in TAP output
../cpan/Encode/t/undef.t....................................FAILED
    Non-zero exit status: 1
    No plan found in TAP output
../cpan/Encode/t/Unicode.t..................................FAILED
    Non-zero exit status: 1
    Bad plan.  You planned 56 tests but ran 0.
../cpan/Encode/t/use-Encode-Alias.t.........................FAILED
    Non-zero exit status: 1
    No plan found in TAP output
../cpan/Encode/t/utf8messages.t.............................FAILED
    Non-zero exit status: 1
    No plan found in TAP output
../cpan/Encode/t/utf8ref.t..................................FAILED
    Non-zero exit status: 1
    No plan found in TAP output
../cpan/Encode/t/utf8strict.t...............................FAILED
    Non-zero exit status: 1
    No plan found in TAP output
../cpan/Encode/t/utf8warnings.t.............................FAILED
    Non-zero exit status: 1
    No plan found in TAP output
../cpan/podlators/t/text/basic.t............................FAILED
    Non-zero exit status: 1
    Bad plan.  You planned 9 tests but ran 0.
../cpan/podlators/t/text/color.t............................FAILED
    Non-zero exit status: 1
    Bad plan.  You planned 4 tests but ran 0.
../cpan/podlators/t/text/empty.t............................FAILED
    Non-zero exit status: 1
    Bad plan.  You planned 8 tests but ran 0.
../cpan/podlators/t/text/encoding.t.........................FAILED
    Non-zero exit status: 1
    Bad plan.  You planned 7 tests but ran 0.
../cpan/podlators/t/text/options.t..........................FAILED
    Non-zero exit status: 1
    Bad plan.  You planned 37 tests but ran 0.
../cpan/podlators/t/text/overstrike.t.......................FAILED
    Non-zero exit status: 1
    Bad plan.  You planned 4 tests but ran 0.
../cpan/podlators/t/text/perlio.t...........................FAILED
    Non-zero exit status: 1
    Bad plan.  You planned 4 tests but ran 0.
../cpan/podlators/t/text/termcap.t..........................FAILED
    Non-zero exit status: 1
    Bad plan.  You planned 4 tests but ran 0.
../cpan/podlators/t/text/utf8.t.............................FAILED
    Non-zero exit status: 1
    Bad plan.  You planned 4 tests but ran 0.
../cpan/Pod-Perldoc/t/00_load.t.............................FAILED
    Non-zero exit status: 1
    Bad plan.  You planned 12 tests but ran 0.
../cpan/podlators/t/general/basic.t.........................FAILED
    Non-zero exit status: 1
    Bad plan.  You planned 15 tests but ran 0.
../cpan/podlators/t/general/filehandle.t....................FAILED
    Non-zero exit status: 1
    Bad plan.  You planned 4 tests but ran 0.
../cpan/podlators/t/general/pod-parser.t....................FAILED
    Non-zero exit status: 1
    Bad plan.  You planned 7 tests but ran 0.
../dist/encoding-warnings/t/1-warning.t.....................FAILED
    Non-zero exit status: 1
    No plan found in TAP output
../ext/PerlIO-encoding/t/encoding.t.........................FAILED
    Non-zero exit status: 1
    No plan found in TAP output
../ext/PerlIO-encoding/t/fallback.t.........................FAILED
    Non-zero exit status: 1
    No plan found in TAP output
../ext/PerlIO-encoding/t/nolooping.t........................FAILED
    Non-zero exit status: 1
    Bad plan.  You planned 1 tests but ran 0.
../ext/PerlIO-encoding/t/threads.t..........................FAILED
    Non-zero exit status: 1
    Bad plan.  You planned 4 tests but ran 0.
../ext/XS-APItest/t/utf16_to_utf8.t.........................FAILED
    Non-zero exit status: 1
    No plan found in TAP output
../cpan/Pod-Perldoc/t/man/_get_columns.t....................FAILED
    Non-zero exit status: 1
    No plan found in TAP output
../ext/XS-APItest/t/fetch_pad_names.t.......................FAILED
    Non-zero exit status: 1
    No plan found in TAP output
../lib/open.t...............................................FAILED
    Non-zero exit status: 1
    No plan found in TAP output
../cpan/ExtUtils-Constant/t/Constant.t......................FAILED
    Non-zero exit status: 1
    No plan found in TAP output

Passed Todo tests: (common-args) none
[stdio/perlio] 
[stdio/perlio] -DDEBUGGING
[stdio/perlio] -Duse64bitall
[stdio/perlio] -DDEBUGGING -Duse64bitall
[stdio/perlio] -Duseithreads
[stdio/perlio] -DDEBUGGING -Duseithreads
[stdio/perlio] -Duseithreads -Duse64bitall
[stdio/perlio] -DDEBUGGING -Duseithreads -Duse64bitall
../dist/Net-Ping/t/450_service.t............................PASSED
    9, 18

[univ.utf8] 
[univ.utf8] -DDEBUGGING
[univ.utf8] -Duse64bitall
[univ.utf8] -DDEBUGGING -Duse64bitall
[univ.utf8] -Duseithreads
[univ.utf8] -DDEBUGGING -Duseithreads
[univ.utf8] -Duseithreads -Duse64bitall
[univ.utf8] -DDEBUGGING -Duseithreads -Duse64bitall
../lib/B/Deparse.t..........................................PASSED
    2
../dist/Net-Ping/t/450_service.t............................PASSED
    9, 18

Compiler messages(hpux):


Non-Fatal messages(hpux):


Status overview available here: https://smoke.procura.nl/

-- 
Report by Test::Smoke v1.70_01 running on perl 5.14.2
(Reporter v0.053 / Smoker v0.046)

Thread Next


nntp.perl.org: Perl Programming lists via nntp and http.
Comments to Ask Bjørn Hansen at ask@perl.org | Group listing | About