develooper Front page | perl.daily-build.reports | Postings from September 2017

Smoke [blead] v5.27.3-88-gd6150e1074 FAIL(XF) dragonfly 4.8-RELEASE(x86_64/)

From:
Tomasz Konojacki
Date:
September 12, 2017 03:46
Subject:
Smoke [blead] v5.27.3-88-gd6150e1074 FAIL(XF) dragonfly 4.8-RELEASE(x86_64/)
Message ID:
59b7588c.5b07e.133d97ca@boettgerilla-pallens.xenu.pl
Automated smoke report for branch blead 5.27.4 patch d6150e10749d85cf1797627bdf8cf9a86cd8d6e6 v5.27.3-88-gd6150e1074
boettgerilla-pallens.xenu.pl: x86_64 (x86_64/)
    on        dragonfly - 4.8-RELEASE
    using     cc version 5.4.1 [DragonFly] Release/2016-08-27
    smoketime 5 hours 34 minutes (average 41 minutes 52 seconds)

Summary: FAIL(XF)

O = OK  F = Failure(s), extended report at the bottom
X = Failure(s) under TEST but not under harness
? = still running or test results not (yet) available
Build failures during:       - = unknown or N/A
c = Configure, m = make, M = make (after miniperl), t = make test-prep

v5.27.3-88-gd6150e1074  Configuration (common) none
----------- ---------------------------------------------------------
X O F F     
F F F F     -Duselongdouble
F F F F     -Duseithreads
F F F F     -Duseithreads -Duselongdouble
| | | +----- PERLIO = perlio -DDEBUGGING
| | +------- PERLIO = stdio  -DDEBUGGING
| +--------- PERLIO = perlio
+----------- PERLIO = stdio


Locally applied patches:
    SMOKEd6150e10749d85cf1797627bdf8cf9a86cd8d6e6

Tests skipped on user request:
    # One test name on a line
Failures: (common-args) none
[stdio] 
Inconsistent test results (between TEST and harness):
    ../cpan/Sys-Syslog/t/syslog.t........... ....................................... FAILED at test 144

[stdio] -DDEBUGGING
    ../cpan/Sys-Syslog/t/syslog.t...............................FAILED
        145, 188-191
        Non-zero exit status: 5

[perlio] -DDEBUGGING
    ../cpan/Sys-Syslog/t/syslog.t...............................FAILED
        144-145
        Non-zero exit status: 2

[stdio] -Duselongdouble
    ../cpan/Time-Local/t/Local.t................................FAILED
        142, 154-156
        Non-zero exit status: 4
    ../t/op/time.t..............................................FAILED
        21-22, 25-28

[perlio] -Duselongdouble
    ../cpan/Time-Local/t/Local.t................................FAILED
        142, 154-156
        Non-zero exit status: 4
    ../t/op/time.t..............................................FAILED
        19-20, 23-24, 31-32

[stdio] -DDEBUGGING -Duselongdouble
    ../cpan/Sys-Syslog/t/syslog.t...............................FAILED
        147, 189, 191
        Non-zero exit status: 3
    ../cpan/Time-Local/t/Local.t................................FAILED
        No plan found in TAP output
    ../lib/Time/gmtime.t........................................FAILED
        Bad plan.  You planned 121 tests but ran 21.
    ../t/op/time.t..............................................FAILED
        Bad plan.  You planned 72 tests but ran 24.

[perlio] -DDEBUGGING -Duselongdouble
    ../cpan/Time-Local/t/Local.t................................FAILED
        No plan found in TAP output
    ../lib/Time/gmtime.t........................................FAILED
        Bad plan.  You planned 121 tests but ran 21.
    ../t/op/time.t..............................................FAILED
        Bad plan.  You planned 72 tests but ran 0.

[stdio] -Duseithreads
[perlio] -DDEBUGGING -Duseithreads
    ../lib/locale.t.............................................FAILED
        453, 460

[perlio] -Duseithreads
    ../lib/locale.t.............................................FAILED
        453, 460
Inconsistent test results (between TEST and harness):
    ../cpan/Sys-Syslog/t/syslog.t........... ....................................... FAILED at test 144

[stdio] -DDEBUGGING -Duseithreads
    ../lib/locale.t.............................................FAILED
        453, 460
Inconsistent test results (between TEST and harness):
    ../cpan/Sys-Syslog/t/syslog.t........... ....................................... FAILED at test 145

[stdio] -Duseithreads -Duselongdouble
    ../cpan/Time-Local/t/Local.t................................FAILED
        142, 154-156
        Non-zero exit status: 4
    ../lib/locale.t.............................................FAILED
        453, 460
    ../t/op/time.t..............................................FAILED
        21-22, 25-26, 29-30
Inconsistent test results (between TEST and harness):
    ../cpan/Sys-Syslog/t/syslog.t........... ....................................... FAILED at test 147

[perlio] -Duseithreads -Duselongdouble
    ../cpan/Time-Local/t/Local.t................................FAILED
        142, 154-156
        Non-zero exit status: 4
    ../lib/locale.t.............................................FAILED
        453, 460
    ../t/op/time.t..............................................FAILED
        17-18, 21-22, 25-26

[stdio] -DDEBUGGING -Duseithreads -Duselongdouble
    ../cpan/Time-Local/t/Local.t................................FAILED
        No plan found in TAP output
    ../lib/Time/gmtime.t........................................FAILED
        Bad plan.  You planned 121 tests but ran 21.
    ../lib/locale.t.............................................FAILED
        453, 460
    ../t/op/time.t..............................................FAILED
        Bad plan.  You planned 72 tests but ran 18.
Inconsistent test results (between TEST and harness):
    ../cpan/Sys-Syslog/t/syslog.t........... ....................................... FAILED at test 145

[perlio] -DDEBUGGING -Duseithreads -Duselongdouble
    ../cpan/Time-Local/t/Local.t................................FAILED
        No plan found in TAP output
    ../lib/Time/gmtime.t........................................FAILED
        Bad plan.  You planned 121 tests but ran 21.
    ../lib/locale.t.............................................FAILED
        453, 460
    ../t/op/time.t..............................................FAILED
        Bad plan.  You planned 72 tests but ran 0.

Compiler messages(dragonfly):
Socket.c: In function 'XS_Socket_pack_ip_mreq_source':
Socket.c:1558:7: warning: variable 'interface' set but not used [-Wunused-but-set-variable]
B.c: In function 'XS_B__PADNAME_TYPE':
B.xs:2219:8: warning: 'ret' may be used uninitialized in this function [-Wmaybe-uninitialized]
B.xs:2203:6: note: 'ret' was declared here

Non-Fatal messages(dragonfly):



-- 
Report by Test::Smoke v1.71 running on perl 5.26.0
(Reporter v0.053 / Smoker v0.046)



nntp.perl.org: Perl Programming lists via nntp and http.
Comments to Ask Bjørn Hansen at ask@perl.org | Group listing | About