develooper Front page | perl.daily-build.reports | Postings from September 2017

Smoke [blead] v5.27.3-62-g3ff4feb5bd FAIL(F) HP-UX B.11.31/64(ia64/2 cpu)

From:
H.Merijn Brand
Date:
September 11, 2017 07:57
Subject:
Smoke [blead] v5.27.3-62-g3ff4feb5bd FAIL(F) HP-UX B.11.31/64(ia64/2 cpu)
Message ID:
MAILBE4121FC@mail.procura.nl
Automated smoke report for branch blead 5.27.4 patch 3ff4feb5bd226622062600b4127bb8c276c9d5ec v5.27.3-62-g3ff4feb5bd
x2: ia64 (ia64/2 cpu)
    on        HP-UX - B.11.31/64
    using     ccache cc version B3910B A.06.28.02
    smoketime 11 hours 12 minutes (average 1 hour 24 minutes)

Summary: FAIL(F)

O = OK  F = Failure(s), extended report at the bottom
X = Failure(s) under TEST but not under harness
? = still running or test results not (yet) available
Build failures during:       - = unknown or N/A
c = Configure, m = make, M = make (after miniperl), t = make test-prep

v5.27.3-62-g3ff4feb5bd  Configuration (common) none
----------- ---------------------------------------------------------
O O O O O O 
O O O F F F -Duse64bitall
F F F O O O -Duseithreads
O O O O O O -Duseithreads -Duse64bitall
| | | | | +- LC_ALL = univ.utf8 -DDEBUGGING
| | | | +--- PERLIO = perlio -DDEBUGGING
| | | +----- PERLIO = stdio  -DDEBUGGING
| | +------- LC_ALL = univ.utf8
| +--------- PERLIO = perlio
+----------- PERLIO = stdio 

Locally applied patches:
    SMOKE3ff4feb5bd226622062600b4127bb8c276c9d5ec

Testsuite was run only with 'harness'

Failures: (common-args) none
[stdio/perlio/univ.utf8] -DDEBUGGING -Duse64bitall
../cpan/Devel-PPPort/t/call.t...............................FAILED
    Non-zero exit status: 1
    Bad plan.  You planned 52 tests but ran 0.
../cpan/Devel-PPPort/t/cop.t................................FAILED
    Non-zero exit status: 1
    Bad plan.  You planned 28 tests but ran 0.
../cpan/Devel-PPPort/t/exception.t..........................FAILED
    Non-zero exit status: 1
    Bad plan.  You planned 7 tests but ran 0.
../cpan/Devel-PPPort/t/format.t.............................FAILED
    Non-zero exit status: 1
    Bad plan.  You planned 1 tests but ran 0.
../cpan/Devel-PPPort/t/grok.t...............................FAILED
    Non-zero exit status: 1
    Bad plan.  You planned 10 tests but ran 0.
../cpan/Devel-PPPort/t/gv.t.................................FAILED
    Non-zero exit status: 1
    Bad plan.  You planned 7 tests but ran 0.
../cpan/Devel-PPPort/t/HvNAME.t.............................FAILED
    Non-zero exit status: 1
    Bad plan.  You planned 4 tests but ran 0.
../cpan/Devel-PPPort/t/limits.t.............................FAILED
    Non-zero exit status: 1
    Bad plan.  You planned 4 tests but ran 0.
../cpan/Devel-PPPort/t/magic.t..............................FAILED
    Non-zero exit status: 1
    Bad plan.  You planned 23 tests but ran 0.
../cpan/Devel-PPPort/t/memory.t.............................FAILED
    Non-zero exit status: 1
    Bad plan.  You planned 1 tests but ran 0.
../cpan/Devel-PPPort/t/misc.t...............................FAILED
    Non-zero exit status: 1
    Bad plan.  You planned 48 tests but ran 0.
../cpan/Devel-PPPort/t/mPUSH.t..............................FAILED
    Non-zero exit status: 1
    Bad plan.  You planned 10 tests but ran 0.
../cpan/Devel-PPPort/t/MY_CXT.t.............................FAILED
    Non-zero exit status: 1
    Bad plan.  You planned 3 tests but ran 0.
../cpan/Devel-PPPort/t/newCONSTSUB.t........................FAILED
    Non-zero exit status: 1
    Bad plan.  You planned 3 tests but ran 0.
../cpan/Devel-PPPort/t/newRV.t..............................FAILED
    Non-zero exit status: 1
    Bad plan.  You planned 2 tests but ran 0.
../cpan/Devel-PPPort/t/newSV_type.t.........................FAILED
    Non-zero exit status: 1
    Bad plan.  You planned 1 tests but ran 0.
../cpan/Devel-PPPort/t/newSVpv.t............................FAILED
    Non-zero exit status: 1
    Bad plan.  You planned 15 tests but ran 0.
../cpan/Devel-PPPort/t/podtest.t............................FAILED
    Non-zero exit status: 1
    No plan found in TAP output
../cpan/Devel-PPPort/t/ppphtest.t...........................FAILED
    Non-zero exit status: 1
    Bad plan.  You planned 238 tests but ran 0.
../cpan/Devel-PPPort/t/pv_tools.t...........................FAILED
    Non-zero exit status: 1
    Bad plan.  You planned 13 tests but ran 0.
../cpan/Devel-PPPort/t/pvs.t................................FAILED
    Non-zero exit status: 1
    Bad plan.  You planned 12 tests but ran 0.
../cpan/Devel-PPPort/t/shared_pv.t..........................FAILED
    Non-zero exit status: 1
    Bad plan.  You planned 1 tests but ran 0.
../cpan/Devel-PPPort/t/snprintf.t...........................FAILED
    Non-zero exit status: 1
    Bad plan.  You planned 2 tests but ran 0.
../cpan/Devel-PPPort/t/sprintf.t............................FAILED
    Non-zero exit status: 1
    Bad plan.  You planned 2 tests but ran 0.
../cpan/Devel-PPPort/t/strlfuncs.t..........................FAILED
    Non-zero exit status: 1
    Bad plan.  You planned 13 tests but ran 0.
../cpan/Devel-PPPort/t/Sv_set.t.............................FAILED
    Non-zero exit status: 1
    Bad plan.  You planned 5 tests but ran 0.
../cpan/Devel-PPPort/t/sv_xpvf.t............................FAILED
    Non-zero exit status: 1
    Bad plan.  You planned 9 tests but ran 0.
../cpan/Devel-PPPort/t/SvPV.t...............................FAILED
    Non-zero exit status: 1
    Bad plan.  You planned 49 tests but ran 0.
../cpan/Devel-PPPort/t/SvREFCNT.t...........................FAILED
    Non-zero exit status: 1
    Bad plan.  You planned 14 tests but ran 0.
../cpan/Devel-PPPort/t/threads.t............................FAILED
    Non-zero exit status: 1
    Bad plan.  You planned 2 tests but ran 0.
../cpan/Devel-PPPort/t/uv.t.................................FAILED
    Non-zero exit status: 1
    Bad plan.  You planned 10 tests but ran 0.
../cpan/Devel-PPPort/t/variables.t..........................FAILED
    Non-zero exit status: 1
    Bad plan.  You planned 52 tests but ran 0.
../cpan/Devel-PPPort/t/warn.t...............................FAILED
    Non-zero exit status: 1
    Bad plan.  You planned 5 tests but ran 0.

[stdio] -Duseithreads
../cpan/CPAN/t/01loadme.t...................................FAILED
    No plan found in TAP output
../cpan/CPAN/t/02nox.t......................................FAILED
    Bad plan.  You planned 8 tests but ran 0.
../cpan/CPAN/t/03pkgs.t.....................................FAILED
    Bad plan.  You planned 11 tests but ran 0.
../dist/Safe/t/safe1.t......................................FAILED
    No plan found in TAP output
../dist/Safe/t/safe2.t......................................FAILED
    No plan found in TAP output
../dist/Safe/t/safe3.t......................................FAILED
    Bad plan.  You planned 2 tests but ran 0.
../dist/Safe/t/safeload.t...................................FAILED
    No plan found in TAP output
../dist/Safe/t/safenamedcap.t...............................FAILED
    No plan found in TAP output
../dist/Safe/t/safeops.t....................................FAILED
    No plan found in TAP output
../dist/Safe/t/saferegexp.t.................................FAILED
    Bad plan.  You planned 3 tests but ran 0.
../dist/Safe/t/safesecurity.t...............................FAILED
    No plan found in TAP output
../dist/Safe/t/safesort.t...................................FAILED
    No plan found in TAP output
../dist/Safe/t/safeuniversal.t..............................FAILED
    No plan found in TAP output
../dist/Safe/t/safeutf8.t...................................FAILED
    Bad plan.  You planned 7 tests but ran 0.
../dist/Safe/t/safewrap.t...................................FAILED
    No plan found in TAP output
../dist/Storable/t/code.t...................................FAILED
    Bad plan.  You planned 63 tests but ran 0.
../ext/Opcode/t/Opcode.t....................................FAILED
    No plan found in TAP output
../ext/Opcode/t/ops.t.......................................FAILED
    Bad plan.  You planned 2 tests but ran 0.

[perlio] -Duseithreads
../t/porting/podcheck.t.....................................FAILED
    70-71, 74, 78, 116-118, 702
../cpan/CPAN/t/01loadme.t...................................FAILED
    No plan found in TAP output
../cpan/CPAN/t/02nox.t......................................FAILED
    Bad plan.  You planned 8 tests but ran 0.
../cpan/CPAN/t/03pkgs.t.....................................FAILED
    Bad plan.  You planned 11 tests but ran 0.
../dist/Storable/t/code.t...................................FAILED
    Bad plan.  You planned 63 tests but ran 0.
../dist/Safe/t/safe1.t......................................FAILED
    No plan found in TAP output
../dist/Safe/t/safe2.t......................................FAILED
    No plan found in TAP output
../dist/Safe/t/safe3.t......................................FAILED
    Bad plan.  You planned 2 tests but ran 0.
../dist/Safe/t/safeload.t...................................FAILED
    No plan found in TAP output
../dist/Safe/t/safenamedcap.t...............................FAILED
    No plan found in TAP output
../dist/Safe/t/safeops.t....................................FAILED
    No plan found in TAP output
../dist/Safe/t/saferegexp.t.................................FAILED
    Bad plan.  You planned 3 tests but ran 0.
../dist/Safe/t/safesecurity.t...............................FAILED
    No plan found in TAP output
../dist/Safe/t/safesort.t...................................FAILED
    No plan found in TAP output
../dist/Safe/t/safeuniversal.t..............................FAILED
    No plan found in TAP output
../dist/Safe/t/safeutf8.t...................................FAILED
    Bad plan.  You planned 7 tests but ran 0.
../dist/Safe/t/safewrap.t...................................FAILED
    No plan found in TAP output
../ext/Opcode/t/Opcode.t....................................FAILED
    No plan found in TAP output
../ext/Opcode/t/ops.t.......................................FAILED
    Bad plan.  You planned 2 tests but ran 0.

[univ.utf8] -Duseithreads
../t/porting/podcheck.t.....................................FAILED
    70-71, 74, 78, 116-117, 702
../cpan/CPAN/t/01loadme.t...................................FAILED
    No plan found in TAP output
../cpan/CPAN/t/02nox.t......................................FAILED
    Bad plan.  You planned 8 tests but ran 0.
../cpan/CPAN/t/03pkgs.t.....................................FAILED
    Bad plan.  You planned 11 tests but ran 0.
../dist/Storable/t/code.t...................................FAILED
    Bad plan.  You planned 63 tests but ran 0.
../dist/Safe/t/safe1.t......................................FAILED
    No plan found in TAP output
../dist/Safe/t/safe2.t......................................FAILED
    No plan found in TAP output
../dist/Safe/t/safe3.t......................................FAILED
    Bad plan.  You planned 2 tests but ran 0.
../dist/Safe/t/safeload.t...................................FAILED
    No plan found in TAP output
../dist/Safe/t/safenamedcap.t...............................FAILED
    No plan found in TAP output
../dist/Safe/t/safeops.t....................................FAILED
    No plan found in TAP output
../dist/Safe/t/saferegexp.t.................................FAILED
    Bad plan.  You planned 3 tests but ran 0.
../dist/Safe/t/safesecurity.t...............................FAILED
    No plan found in TAP output
../dist/Safe/t/safesort.t...................................FAILED
    No plan found in TAP output
../dist/Safe/t/safeuniversal.t..............................FAILED
    No plan found in TAP output
../dist/Safe/t/safeutf8.t...................................FAILED
    Bad plan.  You planned 7 tests but ran 0.
../dist/Safe/t/safewrap.t...................................FAILED
    No plan found in TAP output
../ext/Opcode/t/Opcode.t....................................FAILED
    No plan found in TAP output
../ext/Opcode/t/ops.t.......................................FAILED
    Bad plan.  You planned 2 tests but ran 0.

Passed Todo tests: (common-args) none
[stdio/perlio] 
[stdio/perlio] -DDEBUGGING
[stdio/perlio] -Duse64bitall
[stdio/perlio] -DDEBUGGING -Duse64bitall
[stdio/perlio] -Duseithreads
[stdio/perlio] -DDEBUGGING -Duseithreads
[stdio/perlio] -Duseithreads -Duse64bitall
[stdio/perlio] -DDEBUGGING -Duseithreads -Duse64bitall
../dist/Net-Ping/t/450_service.t............................PASSED
    9, 18

[univ.utf8] 
[univ.utf8] -DDEBUGGING
[univ.utf8] -Duse64bitall
[univ.utf8] -DDEBUGGING -Duse64bitall
[univ.utf8] -Duseithreads
[univ.utf8] -DDEBUGGING -Duseithreads
[univ.utf8] -Duseithreads -Duse64bitall
[univ.utf8] -DDEBUGGING -Duseithreads -Duse64bitall
../lib/B/Deparse.t..........................................PASSED
    2
../dist/Net-Ping/t/450_service.t............................PASSED
    9, 18

Compiler messages(hpux):


Non-Fatal messages(hpux):


Status overview available here: https://smoke.procura.nl/

-- 
Report by Test::Smoke v1.70_01 running on perl 5.14.2
(Reporter v0.053 / Smoker v0.046)



nntp.perl.org: Perl Programming lists via nntp and http.
Comments to Ask Bjørn Hansen at ask@perl.org | Group listing | About