develooper Front page | perl.daily-build.reports | Postings from September 2017

Smoke [blead] v5.27.3-56-gabbca49b1b FAIL(XF) dragonfly 4.8-RELEASE(x86_64/)

From:
Tomasz Konojacki
Date:
September 10, 2017 15:44
Subject:
Smoke [blead] v5.27.3-56-gabbca49b1b FAIL(XF) dragonfly 4.8-RELEASE(x86_64/)
Message ID:
59b55de9.5b07e.c5d1cf9@boettgerilla-pallens.xenu.pl
Automated smoke report for branch blead 5.27.4 patch abbca49b1b90bcf8e24c2ddb8423c503c144cbe2 v5.27.3-56-gabbca49b1b
boettgerilla-pallens.xenu.pl: x86_64 (x86_64/)
    on        dragonfly - 4.8-RELEASE
    using     cc version 5.4.1 [DragonFly] Release/2016-08-27
    smoketime 5 hours 33 minutes (average 41 minutes 40 seconds)

Summary: FAIL(XF)

O = OK  F = Failure(s), extended report at the bottom
X = Failure(s) under TEST but not under harness
? = still running or test results not (yet) available
Build failures during:       - = unknown or N/A
c = Configure, m = make, M = make (after miniperl), t = make test-prep

v5.27.3-56-gabbca49b1b  Configuration (common) none
----------- ---------------------------------------------------------
O X X O     
F F F F     -Duselongdouble
F F F F     -Duseithreads
F F F F     -Duseithreads -Duselongdouble
| | | +----- PERLIO = perlio -DDEBUGGING
| | +------- PERLIO = stdio  -DDEBUGGING
| +--------- PERLIO = perlio
+----------- PERLIO = stdio


Locally applied patches:
    SMOKEabbca49b1b90bcf8e24c2ddb8423c503c144cbe2

Tests skipped on user request:
    # One test name on a line
Failures: (common-args) none
[perlio] 
Inconsistent test results (between TEST and harness):
    ../cpan/Sys-Syslog/t/syslog.t........... ....................................... FAILED at test 189

[stdio] -DDEBUGGING
Inconsistent test results (between TEST and harness):
    ../cpan/Sys-Syslog/t/syslog.t........... ....................................... FAILED at test 145

[stdio] -Duselongdouble
    ../cpan/Time-Local/t/Local.t................................FAILED
        142, 154-156
        Non-zero exit status: 4
    ../t/op/time.t..............................................FAILED
        23-24, 27-30
Inconsistent test results (between TEST and harness):
    ../cpan/Sys-Syslog/t/syslog.t........... ....................................... FAILED at test 144

[perlio] -Duselongdouble
    ../cpan/Time-Local/t/Local.t................................FAILED
        142, 154-156
        Non-zero exit status: 4
    ../t/op/time.t..............................................FAILED
        23-26, 31-32

[stdio] -DDEBUGGING -Duselongdouble
    ../cpan/Time-Local/t/Local.t................................FAILED
        No plan found in TAP output
    ../lib/Time/gmtime.t........................................FAILED
        Bad plan.  You planned 121 tests but ran 21.
    ../t/op/time.t..............................................FAILED
        Bad plan.  You planned 72 tests but ran 14.

[perlio] -DDEBUGGING -Duselongdouble
    ../cpan/Time-Local/t/Local.t................................FAILED
        No plan found in TAP output
    ../lib/Time/gmtime.t........................................FAILED
        Bad plan.  You planned 121 tests but ran 21.
    ../t/op/time.t..............................................FAILED
        Bad plan.  You planned 72 tests but ran 0.

[stdio] -Duseithreads
    ../lib/locale.t.............................................FAILED
        453, 460
Inconsistent test results (between TEST and harness):
    ../cpan/Sys-Syslog/t/syslog.t........... ....................................... FAILED at test 145

[perlio] -Duseithreads
[stdio] -DDEBUGGING -Duseithreads
    ../lib/locale.t.............................................FAILED
        453, 460

[perlio] -DDEBUGGING -Duseithreads
    ../lib/locale.t.............................................FAILED
        453, 460
Inconsistent test results (between TEST and harness):
    ../cpan/Sys-Syslog/t/syslog.t........... ....................................... FAILED at test 144

[stdio] -Duseithreads -Duselongdouble
    ../cpan/Time-Local/t/Local.t................................FAILED
        142, 154-156
        Non-zero exit status: 4
    ../lib/locale.t.............................................FAILED
        453, 460
    ../t/op/time.t..............................................FAILED
        17-20, 25-26
Inconsistent test results (between TEST and harness):
    ../cpan/Sys-Syslog/t/syslog.t........... ....................................... FAILED at test 144

[perlio] -Duseithreads -Duselongdouble
    ../cpan/Time-Local/t/Local.t................................FAILED
        142, 154-156
        Non-zero exit status: 4
    ../lib/locale.t.............................................FAILED
        453, 460
    ../t/op/time.t..............................................FAILED
        17-18, 21-22, 31-32

[stdio] -DDEBUGGING -Duseithreads -Duselongdouble
    ../cpan/Time-Local/t/Local.t................................FAILED
        No plan found in TAP output
    ../lib/Time/gmtime.t........................................FAILED
        Bad plan.  You planned 121 tests but ran 21.
    ../lib/locale.t.............................................FAILED
        453, 460
    ../t/op/time.t..............................................FAILED
        Bad plan.  You planned 72 tests but ran 22.

[perlio] -DDEBUGGING -Duseithreads -Duselongdouble
    ../cpan/Time-Local/t/Local.t................................FAILED
        No plan found in TAP output
    ../lib/Time/gmtime.t........................................FAILED
        Bad plan.  You planned 121 tests but ran 21.
    ../lib/locale.t.............................................FAILED
        453, 460
    ../t/op/time.t..............................................FAILED
        Bad plan.  You planned 72 tests but ran 0.

Compiler messages(dragonfly):
Socket.c: In function 'XS_Socket_pack_ip_mreq_source':
Socket.c:1558:7: warning: variable 'interface' set but not used [-Wunused-but-set-variable]
B.c: In function 'XS_B__PADNAME_TYPE':
B.xs:2219:8: warning: 'ret' may be used uninitialized in this function [-Wmaybe-uninitialized]
B.xs:2203:6: note: 'ret' was declared here

Non-Fatal messages(dragonfly):



-- 
Report by Test::Smoke v1.71 running on perl 5.26.0
(Reporter v0.053 / Smoker v0.046)



nntp.perl.org: Perl Programming lists via nntp and http.
Comments to Ask Bjørn Hansen at ask@perl.org | Group listing | About