develooper Front page | perl.daily-build.reports | Postings from August 2015

Smoke [smoke-me/khw-norm] v5.23.1-172-g55eb408 FAIL(F) MSWin32 Win2000 SP4 (x86/1 cpu) {smoke-me}

From:
George Greer
Date:
August 5, 2015 17:03
Subject:
Smoke [smoke-me/khw-norm] v5.23.1-172-g55eb408 FAIL(F) MSWin32 Win2000 SP4 (x86/1 cpu) {smoke-me}
Message ID:
20150805170338.8AE004E0C50@zwei
Smoke logs available at http://m-l.org/~perl/smoke/perl/win32/smoke-me/Karl Williamson/log55eb4084d561c28e746ac646230934efaced8327.log.gz",

Known failures on Win32:

../t/win32/popen.t..........................................FAILED
    Non-zero exit status: 9
    No plan found in TAP output

../cpan/Time-HiRes/t/usleep.t...............................FAILED
    3
    Non-zero exit status: 1

../t/op/threads.t...........................................FAILED
    Non-zero exit status: 9
    Bad plan.  You planned 27 tests but ran 9.

../cpan/IPC-Cmd/t/01_IPC-Cmd.t..............................FAILED
    27-28
    42
    115-116
    Non-zero exit status: 2

Automated smoke report for 5.23.2 patch 55eb4084d561c28e746ac646230934efaced8327 v5.23.1-172-g55eb408
perl-win2k: Intel(R) Core(TM) i7 CPU 920 @ 2.67GHz(~2682 MHz) (x86/1 cpu)
    on        MSWin32 - Win2000 SP4
    using     cl version 14.00.50727.762
    smoketime 2 hours 48 minutes (average 42 minutes 2 seconds)

Summary: FAIL(F)

O = OK  F = Failure(s), extended report at the bottom
X = Failure(s) under TEST but not under harness
? = still running or test results not (yet) available
Build failures during:       - = unknown or N/A
c = Configure, m = make, M = make (after miniperl), t = make test-prep

v5.23.1-172-g55eb408  Configuration (common) none
----------- ---------------------------------------------------------
F F         
O O         -Duseithreads
| +--------- -DDEBUGGING
+----------- no debugging


Locally applied patches:
    SMOKE55eb4084d561c28e746ac646230934efaced8327

Failures: (common-args) none
[default] 
[default] -DDEBUGGING
../cpan/File-Path/t/Path.t..................................FAILED
    68
    Non-zero exit status: 2
    Bad plan.  You planned 159 tests but ran 68.

Compiler messages(MSWin32):
op.c(8554) : warning C4244: 'function' : conversion from 'cv_flags_t' to 'char', possible loss of data
MD5.xs(763) : warning C4244: '=' : conversion from 'U32' to 'char', possible loss of data
MD5.xs(764) : warning C4244: '=' : conversion from 'U32' to 'char', possible loss of data
MD5.xs(765) : warning C4244: '=' : conversion from 'U32' to 'char', possible loss of data
MD5.xs(766) : warning C4244: '=' : conversion from 'U32' to 'char', possible loss of data
d:\smoke\perl\smoke-me\build\cpan\socket\socket.xs(77) : warning C4715: 'inet_pton' : not all control paths return a value
-- 
Report by Test::Smoke v1.53 build 1374 running on perl 5.10.0
(Reporter v0.050 / Smoker v0.045)




nntp.perl.org: Perl Programming lists via nntp and http.
Comments to Ask Bjørn Hansen at ask@perl.org | Group listing | About