develooper Front page | perl.perl5.porters | Postings from March 2012

Smoke [blead] v5.15.9-61-g6ca94f4 FAIL(F) MSWin32 Win2000 SP4 (x86/1 cpu)

From:
George Greer
Date:
March 31, 2012 11:06
Subject:
Smoke [blead] v5.15.9-61-g6ca94f4 FAIL(F) MSWin32 Win2000 SP4 (x86/1 cpu)
Message ID:
20120331180633.5AF0C4E1087@zwei
Smoke logs available at http://m-l.org/~perl/smoke/perl/

Automated smoke report for 5.15.9 patch 6ca94f4195fb0098aa03840e9e36566404e034c5 v5.15.9-61-g6ca94f4
perl-win2k: Intel(R) Core(TM) i7 CPU 920 @ 2.67GHz(~2657 MHz) (x86/1 cpu)
    on        MSWin32 - Win2000 SP4
    using     cl version 14.00.50727.762
    smoketime 2 hours 50 minutes (average 42 minutes 36 seconds)

Summary: FAIL(F)

O = OK  F = Failure(s), extended report at the bottom
X = Failure(s) under TEST but not under harness
? = still running or test results not (yet) available
Build failures during:       - = unknown or N/A
c = Configure, m = make, M = make (after miniperl), t = make test-prep

v5.15.9-61-g6ca94f4  Configuration (common) none
----------- ---------------------------------------------------------
F F         
F F         -Duseithreads
| +--------- -DDEBUGGING
+----------- no debugging


Locally applied patches:
    uncommitted-changes
    SMOKE6ca94f4195fb0098aa03840e9e36566404e034c5

Failures: (common-args) none
[default] 
../t/op/alarm.t.............................................FAILED
    4
../cpan/Memoize/t/expmod_t.t................................FAILED
    7
../ext/Pod-Html/t/feature.t.................................FAILED
    1
    Non-zero exit status: 1
../ext/Pod-Html/t/htmldir3.t................................FAILED
    1
    Non-zero exit status: 1
../ext/Pod-Html/t/htmldir4.t................................FAILED
    2
    Non-zero exit status: 1
../ext/Pod-Html/t/htmldir5.t................................FAILED
    1
    Non-zero exit status: 1

[default] -DDEBUGGING
../cpan/Memoize/t/expmod_t.t................................FAILED
    7
../ext/Pod-Html/t/feature.t.................................FAILED
    1
    Non-zero exit status: 1
../ext/Pod-Html/t/htmldir3.t................................FAILED
    1
    Non-zero exit status: 1
../ext/Pod-Html/t/htmldir4.t................................FAILED
    2
    Non-zero exit status: 1
../ext/Pod-Html/t/htmldir5.t................................FAILED
    1
    Non-zero exit status: 1

[default] -Duseithreads
../t/op/fork.t..............................................FAILED
    16
../ext/Pod-Html/t/feature.t.................................FAILED
    1
    Non-zero exit status: 1
../ext/Pod-Html/t/htmldir3.t................................FAILED
    1
    Non-zero exit status: 1
../ext/Pod-Html/t/htmldir4.t................................FAILED
    2
    Non-zero exit status: 1
../ext/Pod-Html/t/htmldir5.t................................FAILED
    1
    Non-zero exit status: 1

[default] -DDEBUGGING -Duseithreads
../t/op/alarm.t.............................................FAILED
    2
../t/op/fork.t..............................................FAILED
    16
../ext/Pod-Html/t/feature.t.................................FAILED
    1
    Non-zero exit status: 1
../ext/Pod-Html/t/htmldir3.t................................FAILED
    1
    Non-zero exit status: 1
../ext/Pod-Html/t/htmldir4.t................................FAILED
    2
    Non-zero exit status: 1
../ext/Pod-Html/t/htmldir5.t................................FAILED
    1
    Non-zero exit status: 1

Passed Todo tests: (common-args) none
[default] 
[default] -DDEBUGGING
[default] -Duseithreads
[default] -DDEBUGGING -Duseithreads
../cpan/CGI/t/tmpdir.t......................................PASSED
    3-9

Compiler messages(MSWin32):
op.c(6525) : warning C4244: 'initializing' : conversion from 'U32' to 'const char', possible loss of data
op.c(10623) : warning C4028: formal parameter 1 different from declaration
..\pp.c(5978) : warning C4244: 'function' : conversion from 'U32' to 'const char', possible loss of data
..\pp_hot.c(2685) : warning C4244: 'initializing' : conversion from 'I32' to 'U8', possible loss of data
..\pp_sort.c(1668) : warning C4244: 'initializing' : conversion from 'I32' to 'U8', possible loss of data
..\toke.c(765) : warning C4244: '=' : conversion from 'U32' to 'U8', possible loss of data
IO.xs(488) : warning C4101: 'ret' : unreferenced local variable
ListUtil.xs(297) : warning C4244: 'initializing' : conversion from 'I32' to 'U8', possible loss of data
ListUtil.xs(335) : warning C4244: 'initializing' : conversion from 'I32' to 'U8', possible loss of data
Base64.xs(394) : warning C4146: unary minus operator applied to unsigned type, result still unsigned
Base64.xs(396) : warning C4146: unary minus operator applied to unsigned type, result still unsigned
POSIX.xs(705) : warning C4101: 'charstring' : unreferenced local variable
scalar.xs(175) : warning C4018: '>' : signed/unsigned mismatch
Piece.xs(950) : warning C4101: 'ret' : unreferenced local variable
APItest.xs(3011) : warning C4244: 'initializing' : conversion from 'I32' to 'U8', possible loss of data
APItest.xs(3323) : warning C4101: 'tmp' : unreferenced local variable
op.c(10623) : warning C4028: formal parameter 2 different from declaration

-- 
Report by Test::Smoke v1.42 build 1267 running on perl 5.10.0
(Reporter v0.035 / Smoker v0.045)




nntp.perl.org: Perl Programming lists via nntp and http.
Comments to Ask Bjørn Hansen at ask@perl.org | Group listing | About