develooper Front page | perl.perl5.porters | Postings from November 2009

Smoke [5.11.2] v5.11.2-83-g4086333 FAIL(F) MSWin32 Win2000 SP4 (x86/1 cpu)

From:
George Greer
Date:
November 28, 2009 17:59
Subject:
Smoke [5.11.2] v5.11.2-83-g4086333 FAIL(F) MSWin32 Win2000 SP4 (x86/1 cpu)
Message ID:
200911290158.nAT1wpq3015060@m-l.org
Automated smoke report for 5.11.2 patch 408633379a1452b4e14d7c3b5e80f7dc05ea7986 v5.11.2-83-g4086333
perl-win2k: Intel(R) Core(TM) i7 CPU 920 @ 2.67GHz(~2438 MHz) (x86/1 cpu)
    on        MSWin32 - Win2000 SP4
    using     cl version 14.00.50727.42
    smoketime 7 hours 6 minutes (average 53 minutes 21 seconds)

Summary: FAIL(F)

O = OK  F = Failure(s), extended report at the bottom
X = Failure(s) under TEST but not under harness
? = still running or test results not (yet) available
Build failures during:       - = unknown or N/A
c = Configure, m = make, M = make (after miniperl), t = make test-prep

v5.11.2-83-g4086333  Configuration (common) none
----------- ---------------------------------------------------------
F O         
O O         -Duselargefiles
O F         -Duseithreads
O F         -Duseithreads -Duselargefiles
| +--------- -DDEBUGGING
+----------- no debugging


Locally applied patches:
    SMOKE408633379a1452b4e14d7c3b5e80f7dc05ea7986

Failures: (common-args) none
[default] 
../t/io/openpid.t...........................................FAILED

[default] -DDEBUGGING -Duseithreads
../t/op/fork.t..............................................FAILED
    17
../dist/threads-shared/t/waithires.t........................FAILED
    12
    Bad plan.  You planned 57 tests but ran 14.

[default] -DDEBUGGING -Duseithreads -Duselargefiles
../t/io/openpid.t...........................................FAILED
../t/op/fork.t..............................................FAILED
    17
../lib/Benchmark.t..........................................FAILED
    13

Compiler messages(MSWin32):
perl.c(4028) : warning C4101: 'len' : unreferenced local variable
d:\smoke\perl\blead\build\pp.c(3531) : warning C4716: 'Perl_pp_crypt' : must return a value
Cwd.xs(75) : warning C4101: 'symlink' : unreferenced local variable

-- 
Report by Test::Smoke v1.39 build 1235 running on perl 5.10.0
(Reporter v0.035 / Smoker v0.044)




nntp.perl.org: Perl Programming lists via nntp and http.
Comments to Ask Bjørn Hansen at ask@perl.org | Group listing | About