develooper Front page | perl.perl5.porters | Postings from November 2009

Smoke [5.11.2] v5.11.2-66-g6b1226d FAIL(F) MSWin32 Win2000 SP4 (x86/1 cpu)

From:
George Greer
Date:
November 24, 2009 09:53
Subject:
Smoke [5.11.2] v5.11.2-66-g6b1226d FAIL(F) MSWin32 Win2000 SP4 (x86/1 cpu)
Message ID:
200911241753.nAOHrJUL017644@m-l.org
Automated smoke report for 5.11.2 patch 6b1226db4432ba7f08619ebe4c5365f692dcbbf7 v5.11.2-66-g6b1226d
perl-win2k: Intel(R) Core(TM) i7 CPU 920 @ 2.67GHz(~3264 MHz) (x86/1 cpu)
    on        MSWin32 - Win2000 SP4
    using     cl version 14.00.50727.42
    smoketime 5 hours 50 minutes (average 43 minutes 48 seconds)

Summary: FAIL(F)

O = OK  F = Failure(s), extended report at the bottom
X = Failure(s) under TEST but not under harness
? = still running or test results not (yet) available
Build failures during:       - = unknown or N/A
c = Configure, m = make, M = make (after miniperl), t = make test-prep

v5.11.2-66-g6b1226d  Configuration (common) none
----------- ---------------------------------------------------------
O F         
O O         -Duselargefiles
F F         -Duseithreads
F F         -Duseithreads -Duselargefiles
| +--------- -DDEBUGGING
+----------- no debugging


Locally applied patches:
    SMOKE6b1226db4432ba7f08619ebe4c5365f692dcbbf7

Failures: (common-args) none
[default] -DDEBUGGING
../lib/Benchmark.t..........................................FAILED
    13

[default] -Duseithreads
[default] -Duseithreads -Duselargefiles
../dist/threads-shared/t/waithires.t........................FAILED
    Bad plan.  You planned 57 tests but ran 9.

[default] -DDEBUGGING -Duseithreads
../t/op/fork.t..............................................FAILED
    17
../dist/threads-shared/t/waithires.t........................FAILED
    Bad plan.  You planned 57 tests but ran 14.

[default] -DDEBUGGING -Duseithreads -Duselargefiles
../t/op/fork.t..............................................FAILED
    17
../dist/threads-shared/t/waithires.t........................FAILED
    Bad plan.  You planned 57 tests but ran 9.

Compiler messages(MSWin32):
perl.c(4028) : warning C4101: 'len' : unreferenced local variable
d:\smoke\perl\blead\build\pp.c(3529) : warning C4716: 'Perl_pp_crypt' : must return a value
Cwd.xs(75) : warning C4101: 'symlink' : unreferenced local variable

-- 
Report by Test::Smoke v1.39 build 1235 running on perl 5.10.0
(Reporter v0.035 / Smoker v0.044)




nntp.perl.org: Perl Programming lists via nntp and http.
Comments to Ask Bjørn Hansen at ask@perl.org | Group listing | About