develooper Front page | perl.perl5.porters | Postings from October 2009

Smoke [5.11.1] v5.11.1-68-g34861f2 FAIL(XF) netbsd 5.0.1 (i386/1 cpu)

From:
Steven Schubiger
Date:
October 27, 2009 22:23
Subject:
Smoke [5.11.1] v5.11.1-68-g34861f2 FAIL(XF) netbsd 5.0.1 (i386/1 cpu)
Message ID:
4ae7d55e.0702d00a.46ec.07b4@mx.google.com
Automated smoke report for 5.11.1 patch 34861f291d6c548304b74dfc30ff27447f1b582f v5.11.1-68-g34861f2
p5netbsd: Intel 686-class (i386/1 cpu)
    on        netbsd - 5.0.1
    using     cc version 4.1.3 20080704 prerelease (NetBSD nb2 20081120)
    smoketime 6 hours 33 minutes (average 49 minutes 14 seconds)

Summary: FAIL(XF)

O = OK  F = Failure(s), extended report at the bottom
X = Failure(s) under TEST but not under harness
? = still running or test results not (yet) available
Build failures during:       - = unknown or N/A
c = Configure, m = make, M = make (after miniperl), t = make test-prep

v5.11.1-68-g34861f2  Configuration (common) none
----------- ---------------------------------------------------------
O O O O     
O O O O     -Duse64bitint
O F O O     -Duseithreads
X X X O     -Duseithreads -Duse64bitint
| | | +----- PERLIO = perlio -DDEBUGGING
| | +------- PERLIO = stdio  -DDEBUGGING
| +--------- PERLIO = perlio
+----------- PERLIO = stdio


Locally applied patches:
    SMOKE34861f291d6c548304b74dfc30ff27447f1b582f

Failures: (common-args) none
[perlio] -Duseithreads
    ../lib/Benchmark.t..........................................FAILED
        126-127

[stdio/perlio] -Duseithreads -Duse64bitint
Inconsistent test results (between TEST and harness):
    ../lib/Benchmark.t......................FAILED at test 127

[stdio] -DDEBUGGING -Duseithreads -Duse64bitint
Inconsistent test results (between TEST and harness):
    ../lib/Benchmark.t......................FAILED at test 126

Compiler messages(gcc):
perlio.c: In function 'PerlIOStdio_set_ptrcnt':
perlio.c:3442: warning: pointer targets in assignment differ in signedness
/usr/include/sys/cdefs_elf.h:67:20: error: missing binary operator before token "("
<command line>:1:1: warning: "TIME_HIRES_STAT" redefined
<command line>:1:1: warning: this is the location of the previous definition

-- 
Report by Test::Smoke v1.40 build 1242 running on perl 5.10.0
(Reporter v0.035 / Smoker v0.044)



nntp.perl.org: Perl Programming lists via nntp and http.
Comments to Ask Bjørn Hansen at ask@perl.org | Group listing | About